program: Gaussian 09
title: 000011500
version: EM64L-G09RevD.01
frameworkgroup: C1[X(C9H11NO)]
method: RPBEPBE
basis: SDD
operation: Freq
keyword: #p
keyword: freq=noraman
keyword: PBEPBE/SDD
title: #p freq=noraman PBEPBE/SDD
converged: YES YES NO NO
title: Mulliken charges:
elementType: O N C C C C C C C C C H H H H H H H H H H H
charge: -0.274589 -0.365813 -0.514646 0.482112 -0.441794 -0.369270 -0.216551 -0.222998 -0.241479 0.263441 -0.771977 0.224532 0.268525 0.231341 0.248038 0.299781 0.226801 0.227046 0.229741 0.254227 0.253795 0.209736
chargesum: 0.00000
title: Mulliken charges with hydrogens summed into heavy atoms:
elementType: O N C C C C C C C C C
charge: -0.274589 -0.066031 -0.021589 0.482112 -0.210453 -0.121232 0.010250 0.004048 -0.011738 0.263441 -0.054219
polarizability: 1.42942104e+02 -3.74083847e+00 9.96581164e+01 -8.93838178e+00 3.98220945e+00 6.80883203e+01
1716.lowfreq: -14.6092 -5.6748 -0.0007 -0.0005 -0.0004 7.5164 19.6746 35.9599 65.5208
frequency: 18.9790 35.6579 65.4116 77.7428 189.7234 217.0659 280.3659 319.6540 403.1739 431.5316 488.3874 547.4048 602.1360 604.9201 612.9825 619.5110 705.0597 754.7245 805.7041 854.3758 867.0854 916.5049 976.0412 977.6185 990.0941 995.4060 1011.8228 1026.9123 1040.7959 1080.7778 1093.4798 1172.3187 1187.1551 1214.5434 1227.4378 1253.6393 1319.0171 1351.8779 1385.3672 1388.2676 1441.6612 1450.0576 1465.3832 1470.8812 1483.5154 1487.7097 1595.5535 1614.5728 1619.1386 2982.7435 2995.6805 3040.6960 3096.4319 3100.5920 3114.8006 3123.9003 3135.8631 3146.7752 3163.8635 3555.4938
redmass: 3.9230 3.6477 1.4867 2.1470 3.7526 4.7664 4.2739 2.3457 2.8023 2.6917 3.6741 2.0736 3.8576 3.5018 1.6731 4.9478 1.8106 1.8157 3.9602 1.2544 2.9291 1.4003 1.6595 1.4154 6.0467 1.3399 2.2484 2.1889 1.6446 2.2444 2.1890 1.0539 1.1121 2.4275 1.2347 2.0057 1.3446 1.4112 2.1311 1.9312 2.1471 1.0459 1.1341 1.1684 2.0108 1.8383 6.0697 6.1079 6.2175 1.0607 1.0360 1.1004 1.0995 1.0991 1.0875 1.0860 1.0912 1.0962 1.1015 1.0780
irintensity: 3.6131 2.8049 6.5420 1.5977 5.2621 4.8614 1.1280 3.1729 0.5250 4.0853 26.1724 45.6295 6.7936 39.7999 43.3346 2.1082 50.1414 48.3539 8.6185 0.0858 7.3219 2.2537 3.8354 0.1310 0.0469 0.9573 5.4832 11.5273 11.4728 16.6656 4.1682 0.1298 0.9035 2.0213 11.0580 129.0545 13.0628 3.6010 40.5303 22.1946 22.9162 14.9604 86.5884 18.7625 65.5458 98.4617 0.7429 36.0239 168.3271 39.4009 12.6625 14.7365 17.0960 13.5251 9.5540 0.7737 12.6302 40.3539 21.5725 15.2882
temp: 298.150 k
press: 1.00000 atm
elementType: 8 7 6 6 6 6 6 6 6 6 6 1 1 1 1 1 1 1 1 1 1 1
symmnumber: 1
zpe: 473697.2 jmol-1
zpe.correction: 0.180422 hartree
zpe.thermalcorrener: 0.191108 hartree
zpe.thermalcorrenthalpy: 0.192052 hartree
zpe.thermalcorrgfe: 0.141648 hartree
zpe.sumelectzpe: -478.738373 hartree
zpe.sumelectthermal: -478.727687 hartree
zpe.sumelectthermalent: -478.726743 hartree
zpe.sumelectthermalfe: -478.777147 hartree
dipole: 1.5264 -0.2278 -3.6199
dipole: 3.9352
quadrupole: -64.6571 -59.1766 -70.0152
quadrupole: -0.8075 9.5086 0.7947
quadrupole: -0.0408 5.4397 -5.3989 -0.8075 9.5086 0.7947
hfenergy: -478.9187952 hartree
pointgroup: C01 [X(C9H11N1O1)]
dipole: -0.5370896 0.7941776 -1.215636 debye
dipolederiv: -0.7481193 0.1092375 0.0015875 0.3030274 -0.5518711 0.2159453 -0.2564014 0.2973123 -0.8489256 -1.2907052 0.2354957 -0.1412092 0.2299869 -0.5798026 0.0084331 -0.0436887 -0.0560204 -0.3474986 0.4257298 0.0199458 -0.0660824 0.1954857 0.2741861 0.1120779 -0.3926047 0.1487801 0.1982828 0.225134 0.0386814 0.1058483 0.0543142 -0.045723 -0.0172961 0.1845568 -0.0258227 -0.0330193 -0.1780418 -0.0039289 0.008316 -0.019328 0.050456 0.0906204 0.0155061 0.0994372 -0.126167 -0.0716502 -0.0848521 -0.0077693 -0.1435423 -0.0367376 0.019427 -0.0459122 0.0112271 -0.154042 0.0567517 -0.0879284 0.020915 -0.1013246 0.0094774 0.0374278 -0.0034631 0.0418569 -0.1277142 -0.0287184 0.0027038 0.0288988 0.0169587 0.0950657 0.0967925 0.0345776 0.0941734 -0.1038367 0.0255935 0.038962 0.0718904 0.040957 -0.0804232 0.0450588 0.0614328 0.0464683 -0.1370547 1.4328173 -0.5208909 0.0026576 -0.7811262 0.6247573 -0.367051 0.1822677 -0.3756794 0.9442053 -0.2619985 0.0243891 0.2276135 0.064608 0.0222515 -0.0325515 0.2276872 -0.0315616 -0.1470181 -0.031303 0.0564215 0.0414254 -0.0041457 -0.1361696 -0.1105315 0.078495 -0.0667327 0.0634392 0.100413 -0.0130785 -0.0761666 -0.0745808 0.0718903 0.0708782 0.0524296 0.0162384 0.0448965 0.0915064 -0.0487433 -0.0344516 -0.0242702 -0.0764361 -0.0937692 -0.0210412 -0.0990679 0.1085405 -0.0095763 0.1015041 -0.0030228 0.1122192 0.0377991 -0.0224212 -0.0100569 -0.0199454 0.1304749 0.2196619 0.0779576 0.0282466 0.1048019 0.2525853 0.059438 0.0754868 0.0577213 0.0987124 -0.060477 0.1075281 -0.0054854 0.1179784 0.0114662 -0.0299239 -0.0097224 -0.0311721 0.1445764 0.0726201 -0.0156625 -0.0236839 -0.0366929 -0.0838409 -0.0984305 -0.0269366 -0.0975068 0.1113449 -0.0933325 -0.0502712 -0.0787869 -0.0532711 0.0796269 -0.0452888 -0.0839102 -0.046057 0.1262064 -0.046365 -0.0631987 -0.0322437 -0.0901918 0.0945241 -0.0056006 -0.0623671 -0.0339692 0.0635127 0.1169794 0.0093279 0.0054047 0.050306 -0.0730894 -0.0521509 0.0434415 -0.0161363 0.0794185 0.0530799 0.0663999 -0.073902 0.0378304 0.0400077 0.1189162 0.0002236 0.0864565 -0.0883344 unknown
polarizability: 141.9589611|-9.3718189|95.9323417|8.639384|10.9535186|72.797238 unknown
InChI: InChI=1S/C9H11NO/c1-8(11)10-7-9-5-3-2-4-6-9/h2-6,10H,7H2,1H3
charge 0 multiplicity 1
22 atoms
O  3.028877 -0.651473 1.246173
N  1.718167 0.71855 -0.10563
C  0.643381 0.885327 0.888571
C  -0.721529 0.448048 0.368031
C  -1.836209 1.318458 0.444522
C  -0.89954 -0.847342 -0.183776
C  -3.107761 0.905325 -0.017671
C  -2.166559 -1.26171 -0.647586
C  -3.276124 -0.386024 -0.566232
C  2.84932 -0.046962 0.144512
C  3.864292 -0.110312 -0.994051
H  0.59823 1.939848 1.224269
H  0.956385 0.272727 1.75561
H  -1.710477 2.323011 0.86836
H  -0.042017 -1.528309 -0.241771
H  1.605996 1.165406 -1.016891
H  -3.961522 1.589206 0.04827
H  -2.292544 -2.266284 -1.067184
H  -4.259817 -0.708056 -0.925843
H  4.821841 0.314845 -0.64639
H  4.051408 -1.167151 -1.250014
H  3.5447 0.428073 -1.903278
