program: Gaussian 09
title: 000138916
version: EM64L-G09RevD.01
frameworkgroup: C1[X(C10H18)]
method: RPBEPBE
basis: SDD
operation: Freq
keyword: #p
keyword: freq=noraman
keyword: PBEPBE/SDD
title: #p freq=noraman PBEPBE/SDD
converged: YES YES NO NO
title: Mulliken charges:
elementType: C C C C C C C C C C H H H H H H H H H H H H H H H H H H
charge: -0.366323 -0.388807 -0.397944 -0.385900 -0.571183 -0.584364 0.365057 0.189639 -0.789318 -0.788881 0.191779 0.186780 0.190598 0.199589 0.198868 0.201137 0.199544 0.197946 0.207556 0.200642 0.203943 0.209117 0.214156 0.219636 0.233297 0.215382 0.219681 0.228373
chargesum: 0.00000
title: Mulliken charges with hydrogens summed into heavy atoms:
elementType: C C C C C C C C C C
charge: 0.012236 0.001380 0.002061 0.011591 -0.162985 -0.171304 0.365057 0.189639 -0.122230 -0.125444
polarizability: 1.26292516e+02 9.85735933e-01 1.03690679e+02 -8.04956815e+00 -5.60603693e-02 8.85340912e+01
1716.lowfreq: -20.0824 -14.6441 -12.5208 -0.0009 0.0004 0.0004 68.3230 87.6187 102.5489
frequency: 68.0503 87.4516 102.4619 116.8737 145.9814 168.1345 273.9594 313.8623 337.5673 345.0229 396.7344 410.5970 458.6380 466.3730 525.6550 602.6083 697.7050 736.2578 762.0857 842.4189 848.9440 873.0016 906.1363 942.2211 952.1108 970.3993 981.1805 1002.0128 1053.9612 1064.8908 1077.4687 1078.4597 1134.0781 1157.7528 1168.3228 1189.5698 1199.3343 1225.4150 1261.9400 1266.9611 1267.5833 1313.9137 1320.5946 1334.4032 1343.1186 1349.5863 1355.1134 1385.6889 1395.7472 1455.1127 1457.4211 1460.1940 1463.0836 1464.1931 1470.1975 1475.8074 1476.4850 1484.6363 1502.3188 1686.7529 2954.5422 2957.2104 2958.5979 2961.6542 2962.4555 2964.7428 2972.7829 2984.3371 3009.1756 3016.0173 3019.2751 3022.1313 3022.9112 3029.4176 3038.0795 3044.6354 3093.4151 3098.9073
redmass: 2.7357 1.1924 1.9468 2.1999 1.2016 1.7217 2.0638 2.9900 2.5265 2.6279 2.3282 2.3242 2.1528 1.8897 2.2401 3.8700 2.1018 1.3702 2.5114 1.7189 2.5582 2.2215 2.0355 1.5686 1.5529 1.3389 1.6151 2.0135 2.2016 1.5437 1.5057 1.6357 2.1528 2.0429 1.7351 1.4492 1.4965 1.3339 1.6552 1.2616 1.4411 1.3628 1.2773 1.3848 1.5214 1.3893 1.4134 1.2642 1.2086 1.0661 1.0748 1.0647 1.0888 1.0792 1.0838 1.0664 1.0682 1.0798 1.0843 6.6321 1.0399 1.0588 1.0439 1.0582 1.0636 1.0626 1.0633 1.0629 1.0997 1.0975 1.0968 1.0962 1.1001 1.1001 1.0990 1.0994 1.0947 1.0941
irintensity: 0.3189 0.0030 0.2267 0.0012 1.2307 0.0863 0.3378 0.1984 0.3576 3.7655 1.0505 2.0632 0.7760 0.8600 0.3314 0.3565 2.0954 2.2995 2.8601 4.4161 3.0413 0.0840 5.8727 0.7368 2.1636 1.1151 4.5550 0.2260 0.5715 3.1039 8.4075 2.2664 3.3924 2.1480 2.1774 11.9433 0.8713 1.9536 0.7642 2.4892 1.3958 0.3094 0.4368 0.1404 0.2139 0.3039 0.2273 18.6709 11.9170 3.8995 1.6114 1.1011 13.7955 6.9565 1.2173 29.9691 2.6260 18.3805 15.8448 1.1166 22.1502 34.1703 100.4788 5.5962 24.3701 41.1535 56.7413 39.9901 27.4402 66.7477 2.1736 44.3850 86.8939 54.6494 30.7056 114.5066 37.1372 26.6938
temp: 298.150 k
press: 1.00000 atm
elementType: 6 6 6 6 6 6 6 6 6 6 1 1 1 1 1 1 1 1 1 1 1 1 1 1 1 1 1 1
symmnumber: 1
zpe: 668621.8 jmol-1
zpe.correction: 0.254665 hartree
zpe.thermalcorrener: 0.265979 hartree
zpe.thermalcorrenthalpy: 0.266923 hartree
zpe.thermalcorrgfe: 0.218056 hartree
zpe.sumelectzpe: -391.030492 hartree
zpe.sumelectthermal: -391.019178 hartree
zpe.sumelectthermalent: -391.018233 hartree
zpe.sumelectthermalfe: -391.067100 hartree
dipole: -0.0648 0.0348 -0.2435
dipole: 0.2543
quadrupole: -62.7515 -63.1783 -64.4988
quadrupole: 0.1962 -1.4886 0.2219
quadrupole: 0.7247 0.2979 -1.0226 0.1962 -1.4886 0.2219
hfenergy: -391.2851568 hartree
pointgroup: C01 [X(C10H18)]
dipole: 0.027309 0.0135724 0.0953023 debye
polarizability: 125.9765802|-1.4533261|103.7390617|-8.6449724|0.1780673|88.8016445 unknown
InChI: InChI=1S/C10H18/c1-9(2)10-7-5-3-4-6-8-10/h3-8H2,1-2H3
charge 0 multiplicity 1
28 atoms
C  2.431321 -0.517254 0.261442
C  1.865879 0.760116 0.942481
C  1.399211 -1.670445 0.139281
C  1.152289 1.765984 -0.000326
C  0.210559 -1.420075 -0.835217
C  0.240309 1.113525 -1.085058
C  -0.53377 -0.108812 -0.588836
C  -1.743795 -0.023028 0.051463
C  -2.462104 1.295416 0.308807
C  -2.508093 -1.218342 0.605014
H  3.285078 -0.891581 0.860978
H  2.843091 -0.266484 -0.738426
H  2.686267 1.297856 1.458522
H  1.159523 0.439712 1.73441
H  0.993442 -1.875025 1.151394
H  1.922785 -2.592934 -0.186327
H  1.908143 2.392692 -0.516158
H  0.545043 2.453231 0.622132
H  -0.467241 -2.291354 -0.783933
H  0.612344 -1.402546 -1.869765
H  0.878983 0.795176 -1.931917
H  -0.435319 1.889791 -1.491367
H  -3.516231 1.235715 -0.029151
H  -2.493913 1.517923 1.395037
H  -1.991324 2.155805 -0.192952
H  -2.71201 -1.077749 1.685985
H  -3.49648 -1.314391 0.111286
H  -1.976586 -2.175722 0.4895
