program: Gaussian 09
title: 000138913
version: EM64L-G09RevD.01
frameworkgroup: C1[X(C7H17N2OP)]
method: RPBEPBE
basis: SDD
operation: Freq
keyword: #p
keyword: freq=noraman
keyword: PBEPBE/SDD
title: #p freq=noraman PBEPBE/SDD
converged: NO YES NO NO
title: Mulliken charges:
elementType: P O N N C C C C C C C H H H H H H H H H H H H H H H H H
charge: 0.939584 -0.501786 -0.468883 -0.491441 -0.392045 -0.273059 -0.347760 -0.285043 -0.607384 -0.668340 -0.668773 0.225844 0.267970 0.214480 0.203320 0.245189 0.212705 0.234226 0.192169 0.230637 0.233986 0.214713 0.212346 0.217180 0.216191 0.210981 0.222505 0.210488
chargesum: 0.00000
title: Mulliken charges with hydrogens summed into heavy atoms:
elementType: P O N N C C C C C C C
charge: 0.939584 -0.501786 -0.468883 -0.491441 0.101769 0.144741 0.110134 0.141353 0.071952 -0.022622 -0.024800
polarizability: 1.36107107e+02 -3.92728747e-01 1.14577147e+02 -2.10700821e+00 -8.57587434e-01 9.55344836e+01
1716.lowfreq: -26.8756 -14.2842 -3.3322 0.0018 0.0022 0.0023 17.9068 25.4569 48.3987
frequency: 11.0207 23.2424 47.6906 79.7224 80.8297 119.8852 149.5772 162.0568 203.3625 218.8142 258.5668 283.9181 296.0179 327.8859 363.3480 418.1801 451.6018 489.4836 538.5394 584.0013 588.8122 633.1279 767.5998 786.0361 796.2703 856.9896 870.5632 910.7127 941.6540 962.8961 1008.1016 1038.4414 1058.9772 1072.5348 1101.0480 1104.8729 1126.3941 1159.1148 1173.6629 1184.5465 1185.4803 1259.5071 1286.8700 1310.0680 1314.8867 1324.0169 1336.0343 1370.2081 1377.6999 1377.8060 1428.9757 1438.8743 1459.0635 1460.7902 1464.3361 1470.6493 1471.5140 1476.3364 1478.7649 1487.2261 1488.9061 2911.2372 2926.3637 2975.0431 2977.5311 2982.6291 2990.1996 3025.0754 3025.9120 3034.0644 3036.4338 3063.0832 3070.7237 3073.0223 3078.7992 3079.7730 3087.9122 3095.9820
redmass: 3.5210 2.4182 2.5714 2.6600 2.5484 2.7327 1.2044 1.3200 1.2748 3.2538 1.6784 3.3621 2.2764 2.5310 2.7535 4.0327 3.1993 5.8020 7.7989 3.8108 3.3584 5.4556 1.1751 1.2639 1.9597 3.2740 2.2172 2.0338 4.6559 2.7980 2.6108 1.7033 2.2889 1.9806 1.6077 1.3328 1.5314 1.4147 2.5075 2.0497 2.4427 1.7195 1.1599 1.2282 1.1644 1.1542 1.2216 1.2580 1.2223 1.2168 1.1214 1.0979 1.0545 1.0540 1.0559 1.0750 1.0457 1.0474 1.0701 1.0646 1.0477 1.0690 1.0454 1.0350 1.0426 1.0544 1.0600 1.0602 1.0883 1.0909 1.0998 1.1046 1.0990 1.0986 1.1007 1.0992 1.1009 1.1072
irintensity: 0.8843 0.4189 1.2221 2.6071 2.4214 2.7755 0.3562 1.2136 1.0196 4.5536 1.6332 1.5291 0.3409 8.0760 0.8682 19.5319 3.1878 15.3810 44.5133 24.3629 34.0995 27.5970 16.8311 31.0146 5.5257 68.1313 14.1238 10.4922 37.9511 30.1564 67.5150 17.1675 7.4613 7.5290 5.2476 0.7681 25.6882 3.1362 61.1861 12.8919 12.7909 8.9569 10.9240 10.0896 7.0355 1.9374 7.3438 9.1237 31.5005 9.8648 10.7931 9.3580 4.7827 9.5056 6.5858 4.0803 1.5971 2.2825 29.0293 3.7818 14.6633 106.6591 105.5318 33.7534 14.2045 60.9375 73.2578 39.0299 42.6173 1.4888 3.3122 20.0107 41.2547 61.5330 30.8920 25.5238 55.0951 30.6535
temp: 298.150 k
press: 1.00000 atm
elementType: 15 8 7 7 6 6 6 6 6 6 6 1 1 1 1 1 1 1 1 1 1 1 1 1 1 1 1 1
symmnumber: 1
zpe: 627751.8 jmol-1
zpe.correction: 0.239098 hartree
zpe.thermalcorrener: 0.253652 hartree
zpe.thermalcorrenthalpy: 0.254597 hartree
zpe.thermalcorrgfe: 0.195185 hartree
zpe.sumelectzpe: -801.951488 hartree
zpe.sumelectthermal: -801.936934 hartree
zpe.sumelectthermalent: -801.935990 hartree
zpe.sumelectthermalfe: -801.995401 hartree
dipole: -0.7268 0.9463 1.8355
dipole: 2.1892
quadrupole: -68.4494 -76.2717 -78.7676
quadrupole: -1.2549 -3.2212 -3.2154
quadrupole: 6.0469 -1.7755 -4.2713 -1.2549 -3.2212 -3.2154
hfenergy: -802.1905862 hartree
pointgroup: C01 [X(C7H17N2O1P1)]
dipole: -0.3136902 -0.4275843 -0.6786879 debye
polarizability: 136.2052474|0.575659|114.3454173|0.3010195|-2.3016419|95.6680738 unknown
InChI: InChI=1S/C7H17N2OP/c1-4-9(5-2)11-8(3)6-7-10-11/h4-7H2,1-3H3
charge 0 multiplicity 1
28 atoms
P  -0.452514 -0.316927 1.219521
O  -1.008872 1.414813 1.112966
N  -1.584636 -0.848989 -0.057138
N  0.994339 -0.107822 0.129193
C  -1.792777 0.306602 -0.978664
C  -1.853585 1.601456 -0.101516
C  1.514815 -1.335472 -0.520063
C  1.985754 0.915284 0.545282
C  -2.780573 -1.628959 0.330099
C  2.407351 -2.244537 0.366078
C  2.617797 1.63818 -0.663369
H  -2.721733 0.160173 -1.557112
H  -0.93836 0.363466 -1.671892
H  -1.466462 2.476344 -0.652163
H  -2.883624 1.806731 0.248277
H  0.638814 -1.907246 -0.879309
H  2.083876 -1.031923 -1.420683
H  1.451039 1.663506 1.158869
H  2.793814 0.482934 1.179245
H  -2.515836 -2.332221 1.138928
H  -3.134153 -2.225189 -0.53111
H  -3.624801 -0.999343 0.688575
H  2.736782 -3.13232 -0.206273
H  3.312335 -1.714331 0.714157
H  1.853782 -2.595731 1.256639
H  3.187819 0.944193 -1.307817
H  1.830503 2.110829 -1.276603
H  3.315805 2.423398 -0.316515
