program: Gaussian 09
title: 000138877
version: EM64L-G09RevD.01
frameworkgroup: C1[X(C10H13BrO)]
method: RPBEPBE
basis: SDD
operation: Freq
keyword: #p
keyword: freq=noraman
keyword: PBEPBE/SDD
title: #p freq=noraman PBEPBE/SDD
converged: YES YES NO NO
title: Mulliken charges:
elementType: Br O C C C C C C C C C C H H H H H H H H H H H H H
charge: -0.043041 -0.273723 -0.555064 0.534351 -0.325425 -0.544531 -0.426603 -0.676967 0.343528 -0.216178 -0.379678 -0.537102 0.210947 0.208846 0.242238 0.244155 0.255345 0.232562 0.277060 0.278630 0.221388 0.242663 0.221260 0.220571 0.244769
chargesum: 0.00000
title: Mulliken charges with hydrogens summed into heavy atoms:
elementType: Br O C C C C C C C C C C
charge: -0.043041 -0.273723 -0.135272 0.534351 0.160968 -0.289186 -0.194041 -0.121278 0.343528 0.005211 -0.137015 0.149498
polarizability: 1.77626371e+02 7.89154639e+00 1.13602767e+02 5.47303373e+00 -6.48716932e+00 9.11695499e+01
1716.lowfreq: -9.8874 -2.6267 0.0004 0.0005 0.0006 4.3359 12.8931 48.0387 69.6620
frequency: 12.4797 48.0307 69.6537 89.3116 98.5808 175.8678 199.6595 206.1430 217.3371 259.8870 320.0540 325.7072 440.0393 457.5609 522.3584 552.8188 608.6832 633.4429 698.8243 729.8275 753.5359 784.6461 822.9202 871.4561 884.8801 895.8692 965.5076 981.2832 995.1237 1001.5961 1021.2032 1059.4297 1082.0239 1110.6045 1111.7257 1144.1813 1164.6504 1185.6612 1218.2543 1246.8486 1255.2580 1281.8186 1287.4189 1301.9496 1330.6719 1389.6833 1431.6294 1448.2674 1450.2886 1465.5935 1470.8739 1474.7775 1478.2909 1485.1413 1589.1893 1621.0980 2958.3975 2981.1485 3011.9094 3034.2354 3045.0345 3045.8433 3073.7635 3122.4300 3124.2159 3130.0087 3142.6299 3146.1328 3167.2390
redmass: 5.0274 5.0011 2.0607 3.6933 2.6502 4.2604 1.7309 4.4820 3.2486 1.8179 2.8012 3.6211 4.1068 3.1118 5.0753 4.7786 4.5041 5.4630 2.0903 4.3656 1.0858 1.5849 1.2936 1.5550 2.1861 2.0519 1.3268 5.2908 2.1133 3.6188 2.1100 3.7750 1.4764 1.2427 1.2600 1.5350 1.4334 1.2114 1.1657 1.5026 2.4568 1.1271 1.3962 1.2673 1.3888 8.0174 1.3057 2.0829 1.1328 1.0506 1.1562 1.0959 2.1817 1.0991 6.1488 6.6932 1.0330 1.0589 1.0598 1.1021 1.0563 1.1038 1.1047 1.0868 1.0991 1.1110 1.0925 1.0925 1.0963
irintensity: 0.1989 1.6106 1.0673 6.5337 0.9059 1.5056 0.7056 1.5663 3.7266 0.7343 1.3174 5.9175 1.2719 10.5398 5.1791 12.9875 5.1579 18.3972 28.3139 20.2295 7.4780 43.4833 2.1916 3.1096 11.7471 11.1767 0.3645 2.9181 18.8795 0.1170 53.1983 9.8488 10.2161 1.6513 0.2385 27.2967 55.6954 4.3860 12.0524 7.5389 109.4541 0.4907 39.1269 1.2634 6.9253 8.1495 23.7781 26.9023 6.6218 12.9890 8.9742 18.0832 46.8780 12.8850 56.4956 99.2425 68.2604 28.7687 15.0396 10.2383 25.6399 52.0630 16.6113 5.6543 25.7668 16.2662 24.0051 4.2755 14.9331
temp: 298.150 k
press: 1.00000 atm
elementType: 35 8 6 6 6 6 6 6 6 6 6 6 1 1 1 1 1 1 1 1 1 1 1 1 1
symmnumber: 1
zpe: 536600.5 jmol-1
zpe.correction: 0.204380 hartree
zpe.thermalcorrener: 0.217116 hartree
zpe.thermalcorrenthalpy: 0.218060 hartree
zpe.thermalcorrgfe: 0.161812 hartree
zpe.sumelectzpe: -476.627428 hartree
zpe.sumelectthermal: -476.614693 hartree
zpe.sumelectthermalent: -476.613748 hartree
zpe.sumelectthermalfe: -476.669997 hartree
dipole: -3.4044 1.0649 0.5170
dipole: 3.6043
quadrupole: -76.5121 -79.4812 -81.0612
quadrupole: 4.2493 10.7946 -0.7316
quadrupole: 2.5061 -0.4631 -2.0430 4.2493 10.7946 -0.7316
hfenergy: -476.8318082 hartree
pointgroup: C01 [X(C10H13Br1O1)]
dipole: -1.2817702 -0.4748001 -0.3775153 debye
dipolederiv: -0.5686324 -0.100505 -0.1377134 -0.1401343 -0.1876763 -0.0542657 -0.320243 -0.0872914 -0.305744 -1.2513239 0.5501193 0.0798808 0.796485 -0.804264 -0.0568068 0.056199 -0.0138892 -0.3093219 -0.1890288 -0.0838842 -0.0532925 -0.0572076 0.1638897 -0.0075826 0.0421404 0.0227925 0.2017945 0.4474412 -0.0043044 -0.0629867 0.0351111 0.1726768 -0.0789018 -0.1951151 -0.0871752 -0.0650841 -0.1479678 -0.0460556 0.0006722 -0.0678428 0.0843439 -0.0327225 -0.1042665 -0.0582555 -0.0885467 -0.4696926 0.2238058 -0.0404291 0.0575163 -0.0839742 -0.064035 0.0628979 -0.1082076 -0.1497428 -0.2993945 -0.117169 0.0150246 -0.112854 -0.1206995 0.0030977 0.0592091 0.0069125 -0.2060969 0.6521944 0.1478577 0.3165708 0.162843 0.1901724 0.1137664 0.3496148 0.1186299 0.4219566 0.8260026 -0.5525666 -0.0051247 -0.9077038 0.8000954 0.0323786 0.0753639 -0.0410912 0.1117577 0.1963236 0.0186716 -0.0992038 -0.0920789 0.1290653 -0.0528763 -0.0739761 -0.0874827 -0.0702997 -0.149517 -0.0417529 -0.0413911 0.2993981 -0.327768 -0.0545316 -0.1286253 0.0464603 -0.1979351 0.8259201 -0.2224234 -0.0661001 0.0355651 0.2196522 0.0264869 -0.1817804 0.110948 0.3396366 0.0453154 0.0048028 0.0056916 -0.0320169 -0.0374764 0.1427052 0.0222597 0.0813551 -0.0474601 0.0062979 0.0547319 0.0620462 0.0776241 -0.0800261 -0.1095297 0.0355907 -0.0531777 0.0230684 0.0731773 -0.0231893 -0.0039069 -0.0018722 -0.0193562 0.1023284 0.0443003 0.0873962 -0.0225989 0.0431787 0.0607931 0.0194561 0.0562895 -0.0471889 -0.0813831 0.0588241 -0.0534659 0.0353233 0.1039226 -0.0426243 0.0454617 -0.0429342 -0.0209747 0.0673947 0.035718 0.07064 0.1156378 -0.0071696 0.1258449 0.0235904 0.1160981 -0.0061075 0.0227198 0.0216829 0.0140788 0.1364419 -0.0176593 -0.0101098 -0.0506548 0.0552736 -0.0456391 -0.1086856 -0.0147956 -0.0989154 -0.0287603 0.0021857 -0.0062864 -0.089452 -0.0581462 -0.0030781 0.0657347 -0.0327617 0.0757366 -0.0881094 0.0589829 -0.0473055 0.0394136 -0.0476972 -0.0831225 0.0851184 0.0485479 0.0910753 0.109544 -0.0836637 -0.0084447 0.0821947 -0.0098104 0.1069131 0.023827 0.0873791 0.0244448 0.1364219 -0.0222449 0.0436967 -0.0173895 -0.0748749 0.0958529 0.0843493 0.0845085 0.000835 -0.1663895 -0.0845179 -0.0122455 -0.0271476 -0.1896442 -0.0137002 -0.0915917 -0.0235892 -0.0992244 0.001386 0.0098701 0.0885426 0.0047892 0.1426136 -0.0816099 0.0230053 -0.0090832 0.036871 0.1131209 unknown
polarizability: 178.6778179|-2.5872635|114.261223|1.997675|-3.9650775|89.4596471 unknown
InChI: InChI=1S/C10H13BrO/c1-12-10-6-2-4-9(8-10)5-3-7-11/h2,4,6,8H,3,5,7H2,1H3
charge 0 multiplicity 1
25 atoms
Br 5.298085 0.865272 1.135614
O  -2.858919 1.498372 -0.146102
C  1.653028 -0.270384 -1.024809
C  0.230631 -0.489943 -0.526994
C  2.608729 0.135691 0.140904
C  -0.709447 0.561917 -0.559892
C  -0.157224 -1.744248 0.019142
C  4.033014 0.345529 -0.374588
C  -2.020252 0.375148 -0.05461
C  -1.462366 -1.925995 0.519145
C  -2.407694 -0.873635 0.490262
C  -4.224852 1.365844 0.364771
H  1.668963 0.5218 -1.798053
H  2.036108 -1.195983 -1.497665
H  2.598264 -0.651921 0.916121
H  2.235926 1.061405 0.615499
H  -0.448707 1.541049 -0.97677
H  0.561091 -2.572272 0.044645
H  4.472875 -0.570618 -0.79969
H  4.108789 1.174971 -1.095395
H  -1.756965 -2.896301 0.934918
H  -3.416066 -1.036926 0.881657
H  -4.2295 1.128073 1.446507
H  -4.788966 0.588943 -0.187534
H  -4.689843 2.348813 0.199516
