program: Gaussian 09
title: 000138872
version: EM64L-G09RevD.01
frameworkgroup: C1[X(C8H9NO)]
method: RPBEPBE
basis: SDD
operation: Freq
keyword: #pfreq=noraman
keyword: PBEPBE/SDD
title: #p freq=noraman PBEPBE/SDD
converged: NO YES NO NO
title: Mulliken charges:
elementType: O N C C C C C C C C H H H H H H H H H
charge: -0.219883 -0.035232 -0.003284 0.150229 -0.269044 -0.286655 -0.177650 0.160244 -0.784322 -0.757197 0.283099 0.240438 0.243175 0.230886 0.253877 0.230803 0.249203 0.249322 0.241990
chargesum: 0.00000
title: Mulliken charges with hydrogens summed into heavy atoms:
elementType: O N C C C C C C C C
charge: -0.219883 -0.035232 -0.003284 0.150229 0.014055 -0.046217 0.065526 0.160244 -0.068756 -0.016682
polarizability: 1.28512866e+02 -1.98581844e+00 1.03498181e+02 1.85289667e-03 -6.11213106e-03 4.81366159e+01
1716.lowfreq: -0.0008 -0.0006 -0.0005 7.3554 7.5366 11.9247 37.2619 59.6011 105.8935
frequency: 37.1428 59.5749 105.8868 146.7241 173.4999 197.9871 336.8942 352.5434 421.2449 472.0654 476.0212 541.4934 584.1537 624.8528 684.1882 745.8240 814.1013 877.6061 940.2129 950.0287 960.4609 988.7511 1008.1241 1023.9791 1049.5716 1079.3656 1113.3006 1166.6425 1243.7922 1289.8517 1327.5594 1372.5351 1379.7393 1393.9590 1434.1988 1437.4929 1442.7231 1463.7006 1470.2954 1563.6869 1573.6747 1607.6903 2985.0714 2998.4812 3063.1516 3082.8323 3117.5764 3130.1646 3136.0771 3155.9703 3174.4224
redmass: 1.0617 3.2613 1.0633 5.1242 3.5834 3.1629 3.0052 4.4854 3.9577 3.0848 4.3748 4.7640 4.8638 2.6965 5.8456 2.2890 1.5543 4.1637 1.3364 2.2829 3.8964 1.7412 1.3686 1.8176 1.5980 1.5580 2.3947 1.1170 2.2501 4.6019 6.0405 1.3509 2.4543 1.3265 1.1170 1.0506 2.4979 1.1162 1.0459 5.5983 6.2323 7.9002 1.0382 1.0358 1.0973 1.0947 1.0983 1.1026 1.0881 1.0942 1.0983
irintensity: 0.0150 7.2988 0.0570 0.7281 4.5997 5.7058 12.0094 0.4723 1.0523 2.2592 0.3409 4.5228 21.7091 0.1344 0.2730 17.2517 45.4048 0.2256 1.7277 24.2216 1.6932 5.5824 1.6458 0.7164 9.5872 18.5709 9.2416 0.6241 29.0109 115.1915 22.5304 75.5929 1.7617 28.0528 22.3952 19.7556 38.2319 12.8340 15.2876 7.6678 81.6672 77.0419 17.2776 0.7230 17.8982 7.5612 8.2206 21.3788 6.2545 11.7400 8.8840
temp: 298.150 k
press: 1.00000 atm
elementType: 8 7 6 6 6 6 6 6 6 6 1 1 1 1 1 1 1 1 1
symmnumber: 1
zpe: 393433.2 jmol-1
zpe.correction: 0.149851 hartree
zpe.thermalcorrener: 0.159713 hartree
zpe.thermalcorrenthalpy: 0.160657 hartree
zpe.thermalcorrgfe: 0.113639 hartree
zpe.sumelectzpe: -439.499346 hartree
zpe.sumelectthermal: -439.489483 hartree
zpe.sumelectthermalent: -439.488539 hartree
zpe.sumelectthermalfe: -439.535558 hartree
dipole: 4.0091 -0.1971 0.0003
dipole: 4.0140
quadrupole: -60.2012 -54.1820 -59.9630
quadrupole: 6.1229 0.0038 -0.0040
quadrupole: -2.0858 3.9334 -1.8476 6.1229 0.0038 -0.0040
hfenergy: -439.6491965 hartree
pointgroup: C01 [X(C8H9N1O1)]
dipole: 1.5752237 0.1122701 -0.0006464 debye
dipolederiv: -0.9536457 -0.0840439 0.0002671 -0.1932027 -0.6520328 0.0001596 -0.0000547 -0.000164 -0.3110871 -0.3489238 -0.2163986 0.0000965 0.0543283 -0.3759897 -0.0000168 0.0004185 0.0001103 -0.2050057 -0.2957064 0.2046644 -0.0000147 0.0536406 -0.0083732 -0.0000862 0.0001918 -0.0001778 0.0329548 0.2653824 0.3287035 -0.0002988 0.5637631 0.4120722 -0.0003442 -0.0006197 -0.0005882 0.0264055 -0.1941454 0.1156787 0.0000541 0.0938088 -0.0952361 -0.0000128 0.0001164 -0.0000449 -0.0837703 0.0006016 -0.0289611 -0.0001011 -0.3196814 -0.2629287 0.0001587 -0.0000916 0.0001568 -0.1231437 0.1271201 -0.0817036 -0.0000802 -0.0483344 0.1938564 -0.000019 -0.0000643 0.0000432 -0.1250709 1.4269603 -0.2292194 -0.000254 -0.2396905 1.0214374 -0.0001381 -0.0001625 -0.0000404 0.1171313 -0.1635259 -0.1857001 0.0002612 -0.1490256 -0.1016343 0.0000665 0.0007757 0.0005814 0.0505192 -0.035988 0.0623322 -0.0001544 0.2124845 -0.5373154 0.0003942 -0.0007272 0.0012984 0.0144491 0.0826345 -0.0859016 0.0000439 -0.0590345 0.0541379 0.0000228 0.0000045 0.0000053 0.1639814 -0.1009412 0.0319866 0.0000986 0.0295939 0.099083 -0.0000259 0.0001256 -0.0000202 0.1542461 0.0644659 0.0614765 0.0000221 0.0656261 -0.0837015 -0.0000122 -0.000006 -0.0000233 0.1475586 0.0159218 -0.0344527 0.1038289 -0.0209204 0.059195 -0.0355789 0.1271505 0.0157195 -0.0392688 0.0633141 0.1307591 0.0003191 0.0295607 -0.0425623 -0.0003295 0.0000587 -0.0005083 0.1164162 0.0149362 -0.034172 -0.1042296 -0.0202332 0.0591368 0.0360271 -0.1275535 -0.015454 -0.0382435 0.084399 -0.0093389 0.0888244 -0.0259863 0.0885945 0.0408213 0.066758 0.0677771 -0.0093246 0.0838942 -0.0100909 -0.0893373 -0.0265279 0.0884286 -0.0410652 -0.0669839 -0.0683204 -0.0081116 -0.1367536 0.0643818 0.000654 -0.0001694 0.0838324 -0.0000214 0.0006638 -0.0003505 0.1193642 unknown
polarizability: 128.4132687|2.5346986|103.5977677|-0.0281769|-0.0094394|48.1366264 unknown
InChI: InChI=1S/C8H9NO/c1-6-4-3-5-8(9-6)7(2)10/h3-5H,1-2H3
charge 0 multiplicity 1
19 atoms
O  -2.899356 -0.769022 0.000267
N  0.327566 0.856956 -0.00003
C  -0.56304 -0.187343 0.000361
C  1.664554 0.576823 -0.000597
C  -0.160852 -1.54479 0.000158
C  2.142549 -0.764633 -0.000736
C  1.220867 -1.833476 -0.000349
C  -2.036245 0.156487 0.00099
C  2.619108 1.752919 -0.001296
C  -2.418931 1.623424 0.000874
H  -0.929338 -2.322993 0.000409
H  3.221556 -0.95379 -0.00115
H  1.573087 -2.870315 -0.000435
H  3.273487 1.738241 -0.892881
H  2.04627 2.692837 0.001007
H  3.277545 1.736117 0.887232
H  -1.989156 2.130494 -0.881451
H  -1.983555 2.132625 0.879101
H  -3.515617 1.718138 0.003826
