program: Gaussian 09
title: 000138864
version: EM64L-G09RevD.01
frameworkgroup: C1[X(C10H12)]
method: RPBEPBE
basis: SDD
operation: Freq
keyword: #p
keyword: freq=noraman
keyword: PBEPBE/SDD
title: #p freq=noraman PBEPBE/SDD
converged: NO YES NO NO
title: Mulliken charges:
elementType: C C C C C C C C C C H H H H H H H H H H H H
charge: -0.278778 -0.501779 -0.501737 0.475505 -0.422814 -0.422620 -0.384245 -0.385140 0.436814 -0.806733 0.250986 0.233147 0.232386 0.232395 0.233172 0.238150 0.238134 0.226156 0.226170 0.223353 0.223405 0.234070
chargesum: 0.00000
title: Mulliken charges with hydrogens summed into heavy atoms:
elementType: C C C C C C C C C C
charge: -0.027792 -0.036246 -0.036169 0.475505 -0.184663 -0.184485 -0.158089 -0.158970 0.436814 -0.125905
polarizability: 1.42109259e+02 1.20871721e-02 1.03856773e+02 -4.42475810e+00 -6.13326698e-04 6.22014625e+01
1716.lowfreq: -32.2754 -22.1196 -11.8665 -4.7768 -0.0004 -0.0001 0.0001 25.2326 90.2854
frequency: -31.5671 16.0485 90.2826 160.6170 216.6072 322.1483 338.7844 407.6773 448.6977 450.3295 535.7730 636.8317 665.1036 724.7512 788.7854 800.6439 818.6365 831.4249 853.5640 889.1048 913.2331 955.8569 976.8141 986.2114 1012.2226 1046.5327 1048.7945 1055.8250 1062.2400 1099.7900 1118.2851 1169.4905 1171.9788 1188.6319 1220.6912 1235.0329 1303.5920 1359.8083 1365.6909 1395.5262 1402.1561 1444.1521 1470.3692 1471.2904 1472.1348 1512.6325 1577.9259 1625.0544 2972.4076 3053.2035 3081.3587 3082.6552 3091.5220 3102.4090 3110.8241 3112.1570 3134.5899 3140.7220 3188.9151 3207.0830
redmass: 1.0895 2.4091 3.4750 2.6979 3.4211 2.5808 4.2703 2.8667 3.3136 2.8464 2.6562 6.8652 3.1249 2.7641 1.4112 2.2609 1.2699 1.4170 1.2666 4.1407 3.8370 1.2974 1.3824 1.4149 2.9871 1.5309 1.2359 1.6105 1.2003 1.1915 1.3039 1.3945 2.6050 1.1698 2.9312 1.4226 1.2900 5.5399 2.1762 1.2246 3.2173 1.0867 1.2812 1.0913 1.0633 2.9734 6.1675 6.4684 1.0383 1.0952 1.0997 1.0844 1.0510 1.0656 1.0872 1.0873 1.0958 1.0970 1.1172 1.1152
irintensity: 0.5920 0.0006 1.3460 0.4120 0.5170 0.3194 0.1215 0.0450 6.9573 0.0747 21.6599 0.0476 0.4052 2.8308 3.4658 2.3352 12.6564 45.0012 0.9315 12.9645 3.3505 2.0969 0.0259 0.4110 6.7787 14.8409 33.9821 0.0901 8.4935 0.0431 10.5154 1.4586 0.2476 0.7845 0.5473 5.5844 0.4606 0.4186 8.1118 9.4521 1.3699 8.6929 5.5648 13.3185 15.5347 36.1249 0.1636 0.2853 39.9021 24.8423 18.7484 12.6403 20.9355 11.5882 4.4412 28.7845 45.5025 0.1009 0.2913 40.2317
temp: 298.150 k
press: 1.00000 atm
elementType: 6 6 6 6 6 6 6 6 6 6 1 1 1 1 1 1 1 1 1 1 1 1
symmnumber: 1
zpe: 490083.9 jmol-1
zpe.correction: 0.186663 hartree
zpe.thermalcorrener: 0.195448 hartree
zpe.thermalcorrenthalpy: 0.196393 hartree
zpe.thermalcorrgfe: 0.151506 hartree
zpe.sumelectzpe: -387.501045 hartree
zpe.sumelectthermal: -387.492260 hartree
zpe.sumelectthermalent: -387.491316 hartree
zpe.sumelectthermalfe: -387.536203 hartree
dipole: -0.1706 -0.0008 0.0374
dipole: 0.1746
quadrupole: -53.9323 -56.2805 -62.9740
quadrupole: 0.0046 -2.5312 -0.0016
quadrupole: 3.7966 1.4485 -5.2451 0.0046 -2.5312 -0.0016
hfenergy: -387.6877086 hartree
pointgroup: C01 [X(C10H12)]
dipole: -0.067093 -0.0003206 0.0147921 debye
dipolederiv: 0.012929 0.000034 -0.1109752 -0.0001527 0.1413172 0.0001065 -0.0961426 0.0001058 0.0252644 -0.0023402 0.0399804 -0.0726458 0.0894535 -0.1291034 0.0829128 -0.0654323 0.0789145 0.0368319 -0.0023289 -0.0398235 -0.0727232 -0.0893111 -0.1288243 -0.0832569 -0.0653699 -0.0791691 0.0365711 0.3352874 0.0000375 0.0085476 0.0004659 -0.0746548 0.0000188 -0.16719 0.0000032 -0.0876289 -0.1194228 -0.0391866 -0.0373177 -0.0847552 0.0680904 0.0198598 0.0227535 0.0039236 -0.1392915 -0.1192318 0.0392552 -0.037343 0.0846008 0.0682629 -0.0199057 0.0226401 -0.0039359 -0.1392516 -0.1418588 0.0440522 -0.0155316 0.1340982 0.0773648 -0.0299938 0.0065236 -0.0131052 -0.1712562 -0.1418514 -0.0440949 -0.0154884 -0.1342411 0.0770588 0.0299091 0.0065446 0.0129518 -0.1712246 0.3591594 0.0003359 -0.0678705 0.0007422 -0.055945 -0.0000694 -0.1369564 -0.0000299 -0.0189796 -0.1184938 -0.0002419 0.034189 -0.0014154 0.0844296 0.0001478 0.1377102 0.0001127 0.056604 -0.100332 -0.000034 0.0354705 0.0000275 0.1082782 0.0002142 0.0391134 0.0001803 -0.1041354 -0.0783001 0.1071791 0.0591164 0.1009796 0.0096805 -0.0021959 0.075303 -0.0262805 0.0610096 0.0757831 -0.0376908 0.0845295 -0.0020918 0.0089178 0.078664 0.0703406 0.0793447 -0.0129063 0.0757917 0.037543 0.084593 0.0019854 0.0091915 -0.0785857 0.0703369 -0.0793 -0.0131803 -0.0783055 -0.1072961 0.0589204 -0.1011139 0.0095884 0.0021231 0.075084 0.0261986 0.0610493 0.032017 0.105313 0.0179633 0.0995077 -0.0525922 -0.0102264 0.0092278 -0.0040833 0.1373858 0.0320938 -0.1052523 0.0179755 -0.0994662 -0.0526893 0.0102703 0.0092306 0.0041191 0.137396 -0.0002023 -0.1076191 0.0081853 -0.1049627 -0.0706622 0.011793 0.0084028 0.0118439 0.1468135 -0.0004077 0.107738 0.0081726 0.1049725 -0.0705336 -0.0117406 0.0084197 -0.0117929 0.1468641 0.0025676 0.0380122 -0.0174805 0.1256965 -0.0697761 0.0876463 -0.0705967 0.0759764 0.070206 0.0017622 -0.0381144 -0.0180386 -0.1247501 -0.0679701 -0.0889698 -0.0718285 -0.0770381 0.0687448 -0.0243161 -0.0001269 0.0477515 -0.0002695 0.1105709 0.0012785 0.1118858 0.0010603 -0.1268863 unknown
polarizability: 142.1012477|0.0153146|103.856775|-4.4964824|-0.0038124|62.2094711 unknown
InChI: InChI=1S/C10H12/c1-8-2-4-9(5-3-8)10-6-7-10/h2-5,10H,6-7H2,1H3
charge 0 multiplicity 1
22 atoms
C  2.14603 0.000719 -0.506312
C  3.092192 -0.769347 0.428939
C  3.092038 0.769458 0.430232
C  0.656546 0.000389 -0.273487
C  -0.067706 -1.215445 -0.18557
C  -0.068216 1.215912 -0.185829
C  -1.469455 -1.215217 -0.015027
C  -1.469996 1.215112 -0.015279
C  -2.196474 -0.000185 0.076206
C  -3.700721 -0.000581 0.292465
H  2.43291 0.001653 -1.566703
H  3.952113 -1.285609 -0.008653
H  2.650448 -1.275861 1.29288
H  2.650114 1.274409 1.294994
H  3.951827 1.286663 -0.0065
H  0.47607 -2.165691 -0.252526
H  0.475138 2.166389 -0.252941
H  -2.008465 -2.169114 0.04821
H  -2.009419 2.16878 0.047771
H  -4.17277 0.895718 -0.147856
H  -4.173575 -0.892213 -0.156457
H  -3.94923 -0.005738 1.371941
