program: Gaussian 09
title: 000138857
version: EM64L-G09RevD.01
frameworkgroup: C1[X(C14H13N)]
method: RPBEPBE
basis: SDD
operation: Freq
keyword: #pfreq=noraman
keyword: PBEPBE/SDD
title: #p freq=noraman PBEPBE/SDD
converged: YES YES NO NO
title: Mulliken charges:
elementType: N C C C C C C C C C C C C C C H H H H H H H H H H H H H
charge: -0.106945 0.454602 0.447691 -0.518085 -0.387474 -0.391770 -0.219919 -0.807807 -0.404654 0.323028 -0.390253 -0.389846 -0.203069 -0.203642 -0.256253 0.278652 0.231798 0.234220 0.228492 0.226750 0.232279 0.222798 0.238179 0.243493 0.243310 0.223943 0.223871 0.226611
chargesum: 0.00000
title: Mulliken charges with hydrogens summed into heavy atoms:
elementType: N C C C C C C C C C C C C C C
charge: -0.106945 0.454602 0.447691 -0.239433 -0.155675 -0.157550 0.008573 -0.114552 -0.177905 0.323028 -0.146760 -0.146536 0.020874 0.020229 -0.029642
polarizability: 2.71341001e+02 4.96324646e+00 1.24323109e+02 -1.51015220e-01 -5.60833243e-02 1.08555406e+02
1716.lowfreq: -74.2747 -16.9124 -7.2566 -0.0005 -0.0003 0.0003 0.2605 7.4106 46.9731
frequency: -74.2575 -15.9652 46.9462 55.9204 77.7958 141.0040 199.9572 246.6458 252.6313 310.7066 394.8492 396.9282 416.2983 451.7116 513.4442 523.1875 537.9603 563.5312 613.6335 642.4090 695.7809 703.4551 735.1960 766.9622 796.4625 813.3604 832.4543 894.7353 906.9431 935.2755 939.4414 961.1205 981.3188 983.6407 984.8407 988.6713 993.2672 1010.2584 1022.3556 1051.3505 1076.5572 1097.5775 1147.1953 1168.5445 1178.2006 1180.6516 1199.8443 1264.1087 1298.0325 1306.6301 1368.4034 1370.3496 1393.7730 1400.2512 1434.4564 1436.7154 1465.6532 1473.4294 1475.3552 1485.8621 1578.6372 1593.9390 1604.6430 1614.0130 1641.8558 2950.0309 2978.2563 3060.1367 3088.5522 3118.3473 3123.9063 3126.6764 3131.0666 3141.5171 3147.5294 3153.8778 3156.0403 3167.0968
redmass: 3.9461 1.0136 4.6169 4.6405 3.7567 4.7416 3.0178 4.9726 2.9441 3.4237 3.2358 3.4792 3.6968 3.2188 5.5477 4.0802 4.3700 3.7850 6.4824 6.2342 1.9962 1.9862 3.0955 2.2824 1.4704 5.7576 1.2438 1.4584 1.3236 1.4241 2.1525 1.3660 1.9321 2.3681 1.4279 6.0759 1.5601 1.6094 2.1474 1.5788 1.5397 1.6641 2.0724 1.0507 1.1601 1.0972 2.4107 2.0879 1.4240 1.3764 2.0742 5.8983 3.0559 1.3018 2.4122 2.3562 2.1572 1.2327 1.2898 1.7857 6.1815 5.8218 6.2124 6.3391 8.2727 1.0878 1.0387 1.0951 1.1000 1.0866 1.0843 1.0917 1.0880 1.0918 1.0923 1.0964 1.0989 1.1015
irintensity: 2.8122 0.7391 1.4451 0.4489 1.4037 2.5560 5.9239 0.1865 3.6319 0.7926 0.9741 4.6620 6.8875 2.8843 2.6093 6.1910 11.8062 0.0068 0.0686 8.6816 36.8408 29.8694 31.7373 45.7989 37.0839 53.2281 0.0508 5.6255 0.4490 1.2308 6.8462 0.0007 0.4391 0.1719 5.3744 0.7579 14.3243 0.0713 16.4693 17.7099 8.9226 8.9869 110.2837 0.3525 0.4822 1.2200 29.2031 2.9864 17.8598 0.0828 6.8583 2.8142 1.3068 17.5301 1.9479 15.7693 11.3495 23.3081 17.5415 50.0844 5.4604 7.1733 134.0556 19.4863 281.9552 45.1810 30.6854 21.1928 16.8773 0.3933 3.5925 22.2928 6.1751 4.0925 20.3032 32.4659 33.1301 21.6641
temp: 298.150 k
press: 1.00000 atm
elementType: 7 6 6 6 6 6 6 6 6 6 6 6 6 6 6 1 1 1 1 1 1 1 1 1 1 1 1 1
symmnumber: 1
zpe: 592032.8 jmol-1
zpe.correction: 0.225493 hartree
zpe.thermalcorrener: 0.237080 hartree
zpe.thermalcorrenthalpy: 0.238025 hartree
zpe.thermalcorrgfe: 0.186703 hartree
zpe.sumelectzpe: -594.987612 hartree
zpe.sumelectthermal: -594.976024 hartree
zpe.sumelectthermalent: -594.975080 hartree
zpe.sumelectthermalfe: -595.026401 hartree
dipole: -1.7061 -1.0531 0.0560
dipole: 2.0057
quadrupole: -73.6515 -85.4037 -86.3047
quadrupole: -2.1271 -0.2591 -0.0140
quadrupole: 8.1352 -3.6171 -4.5181 -2.1271 -0.2591 -0.0140
hfenergy: -595.2131049 hartree
pointgroup: C01 [X(C14H13N1)]
dipole: -0.6754895 0.4069279 -0.0287444 debye
polarizability: 271.4282081|-3.4311528|124.2299246|0.2372456|-0.3094745|108.5613835 unknown
InChI: InChI=1S/C14H13N/c1-12-6-5-7-13(10-12)11-15-14-8-3-2-4-9-14/h2-11H,1H3
charge 0 multiplicity 1
28 atoms
N  0.724127 -0.314303 0.007064
C  -1.548974 0.576589 -0.003543
C  -3.575542 -0.831519 0.016371
C  -2.168868 -0.701709 0.01461
C  -2.354364 1.745908 -0.016504
C  -4.364263 0.352645 0.007212
C  -3.760266 1.629969 -0.010662
C  -4.233122 -2.200882 0.006153
C  -0.078152 0.714426 -0.00473
C  2.140446 -0.17231 0.004601
C  2.859013 -0.14765 1.230865
C  2.854303 -0.135654 -1.224176
C  4.268814 -0.073443 1.221832
C  4.264208 -0.062031 -1.219938
C  4.980449 -0.029976 -0.000261
H  -1.520758 -1.585581 0.028105
H  -1.879506 2.734911 -0.028023
H  -5.458018 0.269243 0.015412
H  -4.385694 2.52938 -0.015919
H  0.310838 1.755361 -0.016947
H  -3.639446 -2.938336 0.57401
H  -5.247249 -2.167947 0.441293
H  -4.329643 -2.585287 -1.027773
H  2.306721 -0.194789 2.1755
H  2.298428 -0.173755 -2.167147
H  4.812091 -0.049951 2.17353
H  4.803854 -0.029774 -2.173448
H  6.074373 0.024066 -0.002087
