program: Gaussian 09
title: 000138830
version: EM64L-G09RevD.01
frameworkgroup: C1[X(C16H32)]
method: RPBEPBE
basis: SDD
operation: Freq
keyword: #p
keyword: freq=noraman
keyword: PBEPBE/SDD
title: #p freq=noraman PBEPBE/SDD
converged: YES YES NO NO
title: Mulliken charges:
elementType: C C C C C C C C C C C C C C C C H H H H H H H H H H H H H H H H H H H H H H H H H H H H H H H H
charge: 0.011312 -0.493332 -0.485373 -0.425818 -0.433921 -0.443048 -0.389591 -0.385742 -0.387021 -0.387317 -0.383716 -0.383117 -0.372012 -0.353833 -0.356434 -0.696911 0.204554 0.221262 0.195284 0.189778 0.225877 0.215540 0.202830 0.204145 0.212452 0.199662 0.192073 0.191466 0.206529 0.192698 0.192556 0.192727 0.193732 0.194152 0.192980 0.193426 0.191897 0.191257 0.192528 0.188534 0.189641 0.187207 0.187884 0.194866 0.194397 0.214731 0.209617 0.209592
chargesum: 0.00000
title: Mulliken charges with hydrogens summed into heavy atoms:
elementType: C C C C C C C C C C C C C C C C
charge: 0.215865 -0.076787 -0.069718 -0.007448 -0.017325 -0.051313 0.008404 -0.000488 -0.000561 -0.000184 0.001607 0.000667 0.006163 0.021258 0.032830 -0.062971
polarizability: 2.26682348e+02 -6.73271611e-01 1.51427801e+02 5.81527674e-01 -1.04928914e+00 1.40996576e+02
1716.lowfreq: -6.8721 -0.0015 -0.0007 0.0012 3.1087 15.7022 21.5419 25.1626 28.6858
frequency: 17.0178 22.9522 27.6415 39.0585 44.3626 66.7339 68.1493 79.4624 101.6762 115.5004 126.8683 132.9719 147.5305 152.9115 154.8676 182.6678 223.1793 233.6842 286.2976 308.0052 376.0861 416.8245 431.0185 479.1472 497.4038 576.3107 619.3762 718.7541 721.1953 726.2441 738.3182 754.9412 767.5922 801.7861 809.8837 849.2133 868.3968 888.3125 890.8217 912.8365 945.7776 953.0532 964.5988 981.1736 982.2146 991.7871 1016.2740 1020.5766 1033.0479 1050.2319 1056.0244 1061.7208 1070.9914 1077.8880 1080.5387 1083.0332 1111.3538 1112.6614 1129.0561 1175.8261 1178.9046 1184.9509 1198.6412 1204.0962 1215.3436 1223.3781 1235.2044 1239.9607 1257.3128 1261.1059 1271.2659 1276.4113 1278.3322 1284.3655 1286.8596 1290.0205 1293.7722 1296.9628 1297.3866 1297.5484 1301.3703 1311.0622 1323.0114 1338.0137 1346.4123 1353.0154 1354.0715 1356.5748 1357.6300 1389.7416 1456.8799 1458.4635 1459.8190 1461.5161 1462.7602 1463.4104 1466.4962 1471.0307 1472.1152 1473.8547 1477.3701 1477.4742 1482.1057 1486.0134 1488.8396 1491.3305 2940.8864 2945.6487 2947.8644 2948.0766 2949.4929 2950.1055 2951.8644 2955.5809 2959.8993 2963.5279 2967.5072 2970.1919 2971.3369 2977.6949 2980.3619 2983.0844 2986.9037 2990.2605 2991.3682 2997.9336 3006.7649 3007.4472 3017.4990 3027.6015 3034.5548 3036.6979 3042.4165 3049.4826 3053.8947 3067.6986 3070.1656 3074.2179
redmass: 2.3955 2.2991 3.0657 1.8720 2.9794 1.6666 3.2494 3.0429 1.6986 2.5850 3.2751 1.8375 2.4367 3.2190 2.0525 2.3586 2.7609 1.1130 3.4138 3.4965 2.6703 2.8718 2.3425 2.7338 3.0440 2.7030 2.6743 1.0590 1.0671 1.0873 1.1336 1.2360 1.1682 1.3936 1.3702 1.6560 1.9224 1.9084 2.2416 1.3705 1.7176 1.6292 1.3789 1.8125 1.9896 4.4245 3.3292 1.1673 3.1239 1.5028 2.8930 2.1953 2.6628 2.3145 2.1325 2.2211 1.8525 2.1953 3.1301 1.4932 1.7189 1.5557 1.3931 1.3989 1.4228 1.3143 1.3313 1.3393 1.2872 1.2618 1.2994 1.2297 1.0193 1.2106 1.0730 1.1745 1.1515 1.2616 1.1792 1.1708 1.2501 1.3199 1.4061 1.4423 1.5309 1.7161 1.6306 1.6491 1.6318 1.2181 1.0757 1.0725 1.0749 1.0726 1.0764 1.0706 1.0818 1.0848 1.0848 1.0827 1.0630 1.0634 1.0892 1.0934 1.0928 1.1000 1.0767 1.0639 1.0584 1.0587 1.0590 1.0590 1.0596 1.0597 1.0595 1.0588 1.0585 1.0635 1.0366 1.0638 1.0958 1.0964 1.0972 1.0612 1.0991 1.1016 1.0910 1.0775 1.1044 1.1048 1.0997 1.1037 1.1044 1.0996 1.1015 1.1006 1.0993 1.1046
irintensity: 0.0007 0.0017 0.0064 0.0004 0.0010 0.0005 0.0012 0.0006 0.0029 0.0040 0.0140 0.0003 0.0005 0.0101 0.0041 0.0116 0.0213 0.0004 0.0546 0.2933 0.1318 0.1767 0.1530 0.2685 0.1778 1.1265 0.6381 17.5076 1.1716 5.5913 0.3247 2.5678 4.5496 0.2904 0.9571 1.9711 0.4005 4.5824 5.4830 1.2674 4.5439 2.4090 0.7810 0.4051 1.1542 0.2867 0.5246 0.0919 0.7162 0.3336 0.7102 0.3412 1.1254 0.2014 0.0248 0.2673 0.2123 15.2509 2.8299 1.5177 2.7050 3.3396 3.2900 10.5182 1.9154 0.6081 0.1720 0.0574 0.3824 0.1261 0.3737 0.4242 0.1730 0.1909 0.3351 0.4182 0.9582 1.3409 0.9564 0.4782 0.3146 0.9047 0.3068 0.7788 1.7109 0.1288 0.1916 0.2912 0.2052 11.2308 0.2992 0.0623 0.1245 0.2741 0.7483 0.6030 0.1277 2.6348 7.3178 5.1198 7.2459 9.4626 2.4776 6.7085 33.5388 2.9100 5.5226 11.2572 0.9830 0.7375 0.2073 0.1838 0.5628 2.7566 0.3077 149.0077 194.3870 31.3381 37.1473 70.1721 0.1864 1.5069 4.1067 37.1260 5.2569 2.3566 18.6421 48.4496 0.6007 10.8622 26.6480 2.5669 334.2225 15.6094 22.1900 97.7081 55.5769 126.1950
temp: 298.150 k
press: 1.00000 atm
elementType: 6 6 6 6 6 6 6 6 6 6 6 6 6 6 6 6 1 1 1 1 1 1 1 1 1 1 1 1 1 1 1 1 1 1 1 1 1 1 1 1 1 1 1 1 1 1 1 1
symmnumber: 1
zpe: 1167220.7 jmol-1
zpe.correction: 0.444571 hartree
zpe.thermalcorrener: 0.465172 hartree
zpe.thermalcorrenthalpy: 0.466116 hartree
zpe.thermalcorrgfe: 0.390914 hartree
zpe.sumelectzpe: -627.562019 hartree
zpe.sumelectthermal: -627.541418 hartree
zpe.sumelectthermalent: -627.540474 hartree
zpe.sumelectthermalfe: -627.615676 hartree
dipole: -0.0240 0.0265 -0.0950
dipole: 0.1015
quadrupole: -108.0862 -105.5212 -103.0543
quadrupole: 0.2176 -0.0447 0.9135
quadrupole: -2.5323 0.0327 2.4996 0.2176 -0.0447 0.9135
hfenergy: -628.0065898 hartree
pointgroup: C01 [X(C16H32)]
dipole: 0.0094267 0.0109853 0.0372145 debye
polarizability: 226.6799829|0.8198996|151.4584135|0.5400801|0.9005613|140.9683279 unknown
InChI: InChI=1S/C16H32/c1-2-3-4-5-6-7-8-9-10-13-16-14-11-12-15-16/h16H,2-15H2,1H3
charge 0 multiplicity 1
48 atoms
C  4.977323 -0.157126 0.311346
C  6.230305 -1.020363 0.00422
C  5.291363 1.157787 -0.453152
C  7.428322 -0.027094 0.046528
C  6.815577 1.389936 -0.239042
C  3.642629 -0.831777 -0.071891
C  2.38819 -0.005012 0.293143
C  1.063575 -0.711459 -0.073288
C  -0.190463 0.108825 0.30428
C  -1.517714 -0.570278 -0.102002
C  -2.767553 0.248835 0.291657
C  -4.096788 -0.400923 -0.153938
C  -5.343225 0.417709 0.252034
C  -6.67323 -0.209062 -0.223139
C  -7.917972 0.609184 0.190259
C  -9.242006 -0.013747 -0.302274
H  4.962291 0.066493 1.40103
H  6.350377 -1.863871 0.70872
H  6.124566 -1.453133 -1.011454
H  5.071108 1.003294 -1.529534
H  4.683445 2.015067 -0.112526
H  7.909049 -0.043927 1.042184
H  8.206875 -0.297189 -0.68951
H  7.281379 1.875063 -1.11582
H  6.983573 2.060408 0.624319
H  3.577118 -1.82154 0.427532
H  3.644638 -1.034328 -1.164585
H  2.398284 0.212163 1.382272
H  2.428185 0.977171 -0.220409
H  1.021986 -1.699512 0.431545
H  1.050835 -0.920095 -1.163862
H  -0.131309 1.108353 -0.175784
H  -0.191792 0.291406 1.399522
H  -1.575218 -1.57562 0.365706
H  -1.520486 -0.738495 -1.199544
H  -2.779809 0.391351 1.392783
H  -2.692466 1.264666 -0.150656
H  -4.087821 -0.531697 -1.256524
H  -4.171116 -1.420949 0.278352
H  -5.255802 1.444943 -0.160704
H  -5.36427 0.528957 1.356627
H  -6.655516 -0.313085 -1.328536
H  -6.761659 -1.238716 0.183161
H  -7.940437 0.703751 1.295351
H  -7.822811 1.640753 -0.206833
H  -10.115275 0.589548 0.007576
H  -9.37507 -1.034469 0.103917
H  -9.257482 -0.089093 -1.406155
