program: Gaussian 09
title: 000138828
version: EM64L-G09RevD.01
frameworkgroup: C1[X(C6H4ClN3)]
method: RPBEPBE
basis: SDD
operation: Freq
keyword: #p
keyword: freq=noraman
keyword: PBEPBE/SDD
title: #p freq=noraman PBEPBE/SDD
converged: NO NO NO NO
title: Mulliken charges:
elementType: Cl N N N C C C C C C H H H H
charge: 0.005344 -0.259027 -0.087052 0.037546 0.279658 -0.241060 -0.180656 -0.293743 -0.127976 -0.219431 0.271824 0.283420 0.261478 0.269675
chargesum: 0.00000
title: Mulliken charges with hydrogens summed into heavy atoms:
elementType: Cl N N N C C C C C C
charge: 0.005344 -0.259027 -0.087052 0.037546 0.279658 0.030764 0.102764 -0.032265 0.141699 -0.219431
polarizability: 1.52522919e+02 -1.00902840e+01 9.18277756e+01 3.99545861e-03 -1.87450392e-03 3.58195530e+01
1716.lowfreq: -0.0034 -0.0022 -0.0021 7.2064 13.6812 17.2200 119.4136 211.5324 234.1199
frequency: 119.4048 211.5270 234.1199 327.0193 363.2774 412.7738 457.1257 577.8295 604.6257 627.6491 682.2385 731.4681 736.7050 758.4152 803.3908 870.8676 872.3212 905.6844 953.2049 1038.0362 1092.9255 1098.4267 1138.9851 1196.5576 1255.7970 1288.3453 1332.3840 1401.8592 1430.7238 1437.6041 1502.2031 1600.3193 3183.7612 3202.2018 3228.5696 3271.3950
redmass: 9.6059 4.3324 8.9281 6.5377 18.5110 4.4794 4.8545 7.6541 3.8825 3.7291 9.1039 5.0706 7.0481 1.3445 1.4878 6.6034 1.3971 4.5061 1.3073 1.9158 2.0613 2.4856 1.8639 3.3463 3.5850 2.1608 2.1523 4.9043 4.9193 5.0294 5.5124 8.3106 1.0896 1.0993 1.0951 1.1050
irintensity: 0.6935 12.2150 0.7915 3.1722 2.6593 3.1815 15.9437 4.4887 0.0946 0.0242 14.7077 0.0000 3.1584 65.7796 55.6173 14.8972 10.2516 5.0466 0.6053 57.8598 82.2308 33.8105 14.1716 0.5489 81.3477 25.1295 16.8347 0.8914 2.3537 38.2483 66.7710 29.6177 0.3264 0.2053 5.3745 1.4128
temp: 298.150 k
press: 1.00000 atm
elementType: 17 7 7 7 6 6 6 6 6 6 1 1 1 1
symmnumber: 1
zpe: 244933.8 jmol-1
zpe.correction: 0.093290 hartree
zpe.thermalcorrener: 0.100527 hartree
zpe.thermalcorrenthalpy: 0.101471 hartree
zpe.thermalcorrgfe: 0.060859 hartree
zpe.sumelectzpe: -854.615882 hartree
zpe.sumelectthermal: -854.608645 hartree
zpe.sumelectthermalent: -854.607701 hartree
zpe.sumelectthermalfe: -854.648313 hartree
dipole: -0.0870 0.5029 0.0000
dipole: 0.5104
quadrupole: -67.7644 -58.4939 -66.2353
quadrupole: -10.5157 0.0003 -0.0005
quadrupole: -3.5998 5.6706 -2.0708 -10.5157 0.0003 -0.0005
hfenergy: -854.7091727 hartree
pointgroup: C01 [X(C6H4Cl1N3)]
dipole: 0.045225 0.19565 -0.0000028 debye
dipolederiv: -0.7999599 0.1204717 -0.000049 0.2443958 -0.1370531 0.0000141 -0.0001056 0.0000131 -0.0574113 -0.1652344 0.1594069 0.0000147 0.8660768 0.0982845 0.000018 0.0000026 0.0000127 0.0644198 -0.4590633 -0.032491 -0.0000095 0.1634125 -0.3330498 0.0000007 0.0000096 0.0000005 -0.2499819 -0.3532504 0.0115609 -0.0000529 -0.2756085 -0.2991434 -0.0000388 -0.000034 0.0000054 -0.1078325 0.2482457 -0.0916381 0.000004 -0.7478331 -0.1492998 -0.0000273 -0.0000148 -0.0000018 0.067857 0.5042972 0.0627714 0.0000116 0.1831726 0.200882 0.0000227 0.0000186 0.0000017 -0.0623834 -0.3174547 -0.1408366 -0.0000068 -0.0394196 -0.0494085 0.0000033 0.0000038 -0.0000211 -0.1735426 0.2961823 0.0790607 0.0000002 -0.2448486 0.1352401 0.0000077 -0.0000005 0.0000076 -0.1312368 -0.6078015 0.0866206 -0.0000222 0.320141 -0.1363361 0.0000069 -0.0000391 -0.000004 -0.1272031 1.4248996 -0.2192063 0.0001184 -0.412813 0.435501 0.0000136 0.0001658 -0.0000069 0.0226483 0.0945516 0.0430849 -0.0000018 0.0167818 0.0160277 -0.0000063 0.000011 -0.0000036 0.1613409 0.1150359 0.0438358 -0.0000001 0.0058641 0.0522119 -0.0000053 0.0000021 0.0000036 0.2307339 -0.0176779 -0.0601169 -0.0000024 -0.0320863 0.1057237 -0.0000037 -0.0000119 -0.0000026 0.1794978 0.0372298 -0.062524 -0.000004 -0.0472358 0.0604197 -0.0000055 -0.0000075 -0.0000046 0.1830939 unknown
polarizability: 153.4580837|6.6467524|90.8926105|0.0040938|0.0016487|35.819553 unknown
InChI: InChI=1S/C6H4ClN3/c7-5-1-2-6-8-3-4-10(6)9-5/h1-4H
charge 0 multiplicity 1
14 atoms
Cl 3.487465 -0.689642 0.0001
N  -0.448705 -0.645541 -0.000112
N  -2.210118 0.826094 -0.000094
N  0.852004 -1.11452 -0.000106
C  -0.852487 0.736342 -0.000097
C  0.181485 1.708459 -0.000043
C  -1.600841 -1.418391 -0.000186
C  -2.663075 -0.493623 -0.000126
C  1.508259 1.272491 -0.000019
C  1.762398 -0.138112 -0.000097
H  -0.086196 2.767352 -0.000002
H  -1.562177 -2.502636 -0.000221
H  -3.728254 -0.71631 -0.000134
H  2.346944 1.970838 0.000037
