program: Gaussian 09
title: 000138826
version: EM64L-G09RevD.01
frameworkgroup: C1[X(C13H10IN)]
method: RPBEPBE
basis: SDD
operation: Freq
keyword: #p
keyword: freq=noraman
keyword: PBEPBE/SDD
title: #p freq=noraman PBEPBE/SDD
converged: YES YES NO NO
title: Mulliken charges:
elementType: I N C C C C C C C C C C C C C H H H H H H H H H H
charge: 0.088768 -0.058382 0.572357 -0.282527 -0.517505 -0.372613 0.185768 -0.294953 -0.167396 -0.244243 -0.232814 -0.318092 -0.197039 -0.179493 -0.369253 0.281695 0.229082 0.215042 0.249858 0.231403 0.230894 0.237205 0.238340 0.232019 0.241878
chargesum: 0.00000
title: Mulliken charges with hydrogens summed into heavy atoms:
elementType: I N C C C C C C C C C C C C C
charge: 0.088768 -0.058382 0.572357 -0.000832 -0.517505 -0.143530 0.185768 -0.079910 0.082462 -0.012840 0.004391 -0.087198 0.041301 0.052526 -0.127375
polarizability: 3.19288537e+02 -3.00427690e+01 2.08705506e+02 -2.40479340e+00 -3.81084236e+00 6.04192221e+01
1716.lowfreq: -10.8865 -7.9441 -2.7103 -0.0003 -0.0001 0.0003 3.4112 45.8288 56.2721
frequency: -6.0418 45.8256 56.2714 98.4797 132.4381 156.6374 188.6322 221.6022 258.1120 288.7641 331.6025 403.1293 438.8156 487.7651 499.0657 542.5337 551.6078 612.5604 630.3250 665.1129 716.7974 742.0648 756.4142 787.2786 823.5058 861.1916 868.8101 881.1333 903.6385 951.6431 957.8291 962.1004 985.5096 990.5957 995.0038 1005.0095 1037.3308 1044.8582 1089.0904 1108.2459 1165.4504 1173.8294 1200.5135 1218.7260 1281.7931 1286.4508 1304.7420 1312.3846 1329.9841 1364.7666 1409.9479 1419.2874 1447.1465 1460.2523 1551.8581 1557.1212 1573.8624 1591.3180 1638.1371 3106.1703 3124.2578 3127.6057 3132.7478 3133.2161 3146.0290 3150.5484 3159.7515 3171.6095 3173.4480
redmass: 4.0952 8.2604 4.7661 4.1621 4.4162 5.6572 6.0982 2.5234 8.7598 4.2213 5.5963 3.3347 3.0482 3.4324 3.9560 3.2628 7.5183 6.9969 6.6934 6.4066 3.1389 1.6438 1.2763 2.3230 5.2111 1.7287 2.3491 1.6382 1.6476 1.3862 1.4652 6.7188 1.3570 6.6402 1.3348 1.1714 2.4140 2.1754 1.6325 1.8463 1.0780 1.0672 2.0368 1.2803 1.6768 3.5112 1.5981 1.7025 2.7250 4.5234 1.9744 2.2407 2.2379 2.6950 5.3108 5.5329 5.6447 6.4133 5.7920 1.0919 1.0886 1.0870 1.0876 1.0861 1.0897 1.0942 1.0952 1.1011 1.1002
irintensity: 0.6852 0.4237 1.7406 1.3944 0.2911 0.3777 0.1846 0.1790 2.2980 1.4755 1.1681 3.2782 8.6869 4.6315 1.5639 8.9381 28.8229 0.7385 5.6894 14.8856 5.7660 48.2308 40.1738 61.5307 0.1903 0.7704 4.5700 3.2864 7.7037 0.3137 3.1306 1.2551 4.1664 62.3955 3.1080 43.8776 3.1004 2.5980 2.9397 3.1386 4.8944 1.2409 5.8915 9.5046 3.8628 9.3927 14.7654 0.1314 2.5741 1.3337 15.0377 30.3097 6.3854 107.0627 14.8419 6.7817 94.5619 20.9924 10.3187 13.6085 24.7916 5.8182 5.2054 0.3076 4.9848 24.9496 19.0885 32.8716 22.8494
temp: 298.150 k
press: 1.00000 atm
elementType: 53 7 6 6 6 6 6 6 6 6 6 6 6 6 6 1 1 1 1 1 1 1 1 1 1
symmnumber: 1
zpe: 495195.9 jmol-1
zpe.correction: 0.188610 hartree
zpe.thermalcorrener: 0.200651 hartree
zpe.thermalcorrenthalpy: 0.201595 hartree
zpe.thermalcorrgfe: 0.147921 hartree
zpe.sumelectzpe: -566.591869 hartree
zpe.sumelectthermal: -566.579828 hartree
zpe.sumelectthermalent: -566.578884 hartree
zpe.sumelectthermalfe: -566.632558 hartree
dipole: 1.8530 2.7499 -0.2052
dipole: 3.3223
quadrupole: -75.2465 -87.3175 -109.2345
quadrupole: -2.3684 -0.9125 -0.9350
quadrupole: 15.3530 3.2821 -18.6350 -2.3684 -0.9125 -0.9350
hfenergy: -566.7804791 hartree
pointgroup: C01 [X(C13H10I1N1)]
dipole: 0.3950433 1.0334146 -0.6960161 debye
dipolederiv: 0.0086801 0.1141411 -0.0635736 0.0405428 -0.3771031 0.1984916 -0.017554 0.2022881 -0.1156559 -0.5715674 0.00966 -0.0086938 0.2153525 -0.2581795 0.0323443 -0.1833212 0.0323798 -0.2536795 0.2842237 0.1834892 -0.1111214 -0.0327942 -0.2980397 0.210974 -0.0160106 0.1980675 -0.03342 0.1950082 0.0378622 -0.0293071 -0.087464 -0.0356938 -0.0718771 0.0657283 -0.065414 -0.0569357 -0.1244108 -0.3446438 0.1882752 0.0182227 0.8453563 -0.5576525 -0.0386874 -0.5527192 0.1142856 -0.1441533 -0.076462 0.0619759 0.0720589 0.0009647 -0.0626287 -0.00104 -0.0655295 -0.1022142 1.1376958 0.019652 -0.0138849 -0.0281098 0.0443644 0.0263978 -0.0118104 0.0227315 0.0640258 -0.4321558 -0.0534555 0.0397874 -0.2434442 -0.0145404 -0.1556462 0.2021511 -0.1422417 -0.0754793 -0.0213938 0.1422508 -0.0758412 0.2394164 -0.2861621 0.1037649 -0.1177686 0.1047067 -0.1435894 -0.0688169 -0.0503792 0.0269804 -0.1326165 0.0195458 -0.0886897 0.0555795 -0.090302 -0.1034473 -0.058138 0.0448958 -0.01822 -0.0192222 0.0182542 -0.0947771 0.0115052 -0.0896006 -0.1041357 -0.6620084 -0.0490075 0.038433 -0.1565277 -0.0335423 -0.0856113 0.1370821 -0.0865476 -0.0709142 0.4104239 0.0526933 -0.045613 -0.0320845 0.0400003 -0.1312759 0.0217513 -0.1303294 -0.0118623 -0.0985514 -0.1109393 0.0871735 0.2213323 -0.1863449 0.0441713 -0.1803182 0.0434005 -0.1721125 0.0409822 0.0265693 -0.0266122 -0.2613916 0.1898677 -0.2063403 0.2244338 -0.2038553 0.1079156 0.1244865 0.0184754 -0.0067433 0.0759064 0.0745307 0.0652152 -0.0484822 0.0560328 0.1078964 0.0267998 -0.0854883 0.0366989 -0.0727742 -0.0081434 0.0770385 0.0361433 0.0816662 0.1002629 0.0410798 0.0240556 -0.0168661 0.0680348 0.0097525 0.1246879 -0.0551196 0.122961 0.0557838 0.015171 -0.0609704 0.0335159 -0.0927894 0.0400484 0.0644283 0.0509624 0.0612153 0.1252899 0.0458796 0.0509908 -0.0275331 0.0892264 -0.0430493 0.1086092 -0.0509822 0.1053823 0.1042568 0.0810812 0.0661369 -0.0512944 0.0472653 0.0150996 0.1196671 -0.0372681 0.117003 0.0652684 -0.1158858 0.0402603 -0.022923 0.0313836 0.0785454 0.0471658 -0.0184652 0.0494366 0.1393114 -0.029065 -0.0778308 0.0658878 -0.0993694 0.0541746 0.0789226 0.0834619 0.0785025 0.0839316 -0.1166515 0.0439087 -0.0321477 0.0432737 0.1160321 0.0425606 -0.0344783 0.0419603 0.135117 0.0312864 0.0341352 -0.028353 0.0965719 -0.0057379 0.1100595 -0.0774931 0.1088052 0.0401009 unknown
polarizability: 326.7261707|2.236609|162.0214086|-5.0868764|-63.259204|99.6656861 unknown
InChI: InChI=1S/C13H10IN/c14-13-7-2-1-5-11(13)8-9-12-6-3-4-10-15-12/h1-10H
charge 0 multiplicity 1
25 atoms
I  -2.147471 -2.720585 1.584988
N  2.46953 -0.723331 0.643186
C  -1.774301 0.044921 0.092282
C  -0.325848 -0.164793 0.223431
C  -2.73654 -0.884304 0.597551
C  -2.301976 1.214255 -0.543366
C  2.095299 0.307571 -0.193928
C  0.660304 0.568008 -0.382523
C  -4.126396 -0.669474 0.470014
C  -3.681756 1.439982 -0.678393
C  -4.603949 0.494881 -0.170393
C  3.063654 1.10857 -0.865038
C  4.436323 0.847643 -0.674189
C  4.818493 -0.209229 0.1833
C  3.795603 -0.960648 0.814577
H  0.014441 -0.990929 0.860101
H  -1.599735 1.964159 -0.92195
H  0.419302 1.395644 -1.06297
H  -4.832898 -1.404443 0.865597
H  -4.040848 2.350648 -1.169571
H  2.734606 1.920286 -1.523441
H  -5.682758 0.65763 -0.264292
H  5.192413 1.454959 -1.183066
H  5.871138 -0.449051 0.361765
H  4.04787 -1.78917 1.487229
