program: Gaussian 09
title: 000138824
version: EM64L-G09RevD.01
frameworkgroup: C1[X(C15H32O)]
method: RPBEPBE
basis: SDD
operation: Freq
keyword: #pfreq=noraman
keyword: PBEPBE/SDD
title: #p freq=noraman PBEPBE/SDD
converged: YES YES NO NO
title: Mulliken charges:
elementType: O C C C C C C C C C C C C C C C H H H H H H H H H H H H H H H H H H H H H H H H H H H H H H H H
charge: -0.462355 -0.019666 -0.422488 -0.403525 -0.425698 -0.421044 0.016508 -0.403980 -0.376850 -0.752705 -0.021735 -0.394877 -0.764737 -0.363359 -0.717786 -0.716643 0.190868 0.203047 0.203326 0.194229 0.184514 0.206883 0.204779 0.188566 0.189153 0.244012 0.199363 0.202764 0.186293 0.188740 0.211594 0.211205 0.213413 0.191797 0.183814 0.214904 0.214334 0.225466 0.203706 0.194687 0.191360 0.202742 0.223890 0.209032 0.205512 0.212170 0.210847 0.343933
chargesum: 0.00000
title: Mulliken charges with hydrogens summed into heavy atoms:
elementType: O C C C C C C C C C C C C C C C
charge: -0.118422 0.171202 -0.016115 -0.024782 -0.014036 -0.043325 0.260520 -0.001852 -0.001817 -0.116494 0.170061 0.003841 -0.121231 0.022688 -0.082122 -0.088114
polarizability: 1.94439822e+02 -1.76364828e+00 1.59161031e+02 -2.68700259e+00 4.95891268e-01 1.47761753e+02
1716.lowfreq: -4.6658 -0.0007 -0.0005 -0.0002 6.9795 16.0310 18.8119 24.5312 33.3269
frequency: 17.2867 24.4781 32.7512 42.5528 46.2542 69.4708 78.1872 101.2653 117.2031 136.2265 155.6010 183.7463 193.0908 206.6086 212.5544 219.7296 230.3404 235.7322 251.4783 264.5799 272.9412 301.8424 355.8842 360.8618 378.7923 407.1766 412.7079 433.1293 467.9734 491.0566 501.4525 560.1696 724.1500 732.6455 779.3148 783.5629 805.0829 830.1120 835.9005 867.1222 879.0092 912.2711 932.2288 936.3203 943.5384 948.7202 955.7960 959.1999 973.1291 1001.4001 1022.9151 1033.4381 1037.6945 1065.9936 1069.7683 1075.5320 1093.4823 1119.0484 1126.0049 1148.0531 1151.3591 1165.3260 1178.1469 1180.1509 1193.6892 1203.2791 1214.4026 1236.2082 1246.2474 1262.2315 1276.0919 1281.5756 1289.6910 1294.3339 1300.2866 1309.4212 1320.9386 1330.8742 1335.2360 1345.1727 1346.8150 1353.8108 1356.4398 1361.3082 1368.4635 1374.4312 1382.5231 1385.9471 1391.9411 1404.3162 1440.8979 1454.8548 1458.1412 1463.5833 1465.7056 1468.3803 1469.3544 1471.5316 1473.1404 1476.1567 1478.4817 1480.7521 1482.7683 1484.5397 1489.0480 1496.3915 2938.1371 2938.7958 2942.4598 2945.6143 2952.2735 2954.0761 2961.8253 2964.4011 2964.4248 2967.1323 2967.8157 2969.7985 2972.2723 2977.9248 2986.9548 2989.4195 2992.3336 3003.2116 3006.0443 3013.0699 3031.1303 3033.7307 3039.4245 3056.2596 3060.3148 3061.9350 3063.0129 3064.0185 3065.9100 3068.6036 3075.0862 3570.7640
redmass: 4.3233 3.3631 2.5295 3.3099 3.2895 3.3221 2.8993 2.8505 1.7618 2.5610 2.0462 1.4416 2.0693 1.1030 1.2686 1.8162 1.4867 2.2248 1.7137 1.2870 1.9058 2.0245 2.4596 2.1465 2.1877 2.1856 1.9788 2.2651 2.4049 2.8405 2.4799 2.3325 1.4252 1.1485 2.2785 1.7486 2.0522 1.6838 1.7915 1.8238 2.0404 1.1898 1.6215 1.7128 1.7277 1.4604 1.7561 1.5999 1.6172 1.9572 1.8974 3.0093 1.6822 1.6006 1.8621 2.2743 1.8645 1.9119 1.5829 1.9396 2.2294 2.0464 1.7901 1.4650 1.5174 1.4169 1.3075 1.3597 1.2718 1.3254 1.2815 1.1875 1.1384 1.1932 1.3110 1.1263 1.3885 1.4283 1.4094 1.4344 1.4949 1.4924 1.5237 1.4260 1.4316 1.2212 1.2409 1.2248 1.2159 1.3955 1.0900 1.0705 1.0705 1.0782 1.0800 1.0477 1.0687 1.0600 1.0589 1.0694 1.0691 1.0556 1.0867 1.0606 1.0521 1.0621 1.0549 1.0793 1.0594 1.0614 1.0616 1.0764 1.0597 1.0461 1.0416 1.0454 1.0468 1.0367 1.0566 1.0635 1.1007 1.0970 1.0912 1.1011 1.0944 1.0947 1.1039 1.1003 1.1022 1.0992 1.0974 1.0992 1.0993 1.0988 1.0989 1.0980 1.0985 1.0665
irintensity: 0.1351 0.4649 0.0027 0.6390 1.0936 0.6443 0.0028 0.0283 0.3680 5.6877 0.0692 0.2577 0.9683 0.1199 2.6766 24.4323 0.3972 0.4567 1.1911 93.9894 26.1726 7.6431 1.0005 0.0341 2.4929 0.3227 0.3548 2.3801 2.2080 1.9277 10.3004 5.4394 8.4461 5.4337 1.0680 0.9902 7.2830 8.1328 5.4826 3.7031 0.9559 3.7685 10.5071 9.1734 13.2740 3.3314 4.3620 1.5733 3.2099 3.2501 20.5487 3.7837 23.3880 11.8576 3.0171 2.1798 4.5341 1.8600 1.7222 2.4263 5.9638 4.3904 9.7810 9.8727 6.0337 7.7169 2.2584 2.9958 4.8516 14.8055 15.1965 0.3381 1.1682 3.1743 4.6016 1.2685 5.3140 2.0886 4.5063 2.4967 0.4403 0.1596 3.0562 1.2023 2.0179 20.9114 11.8447 25.8816 15.6345 2.2732 4.3539 0.3364 1.0395 4.3549 6.5885 2.0667 3.9031 5.4599 0.3117 9.4705 10.2411 5.3167 7.9958 25.1991 27.3336 10.3558 77.0035 14.6719 34.2514 8.5777 8.0042 6.4872 46.9546 44.9077 28.8968 78.2772 25.9367 29.2792 14.4812 61.3803 54.0939 14.8384 44.3881 0.1512 15.0853 13.9755 95.0979 69.9426 119.0882 7.7940 44.2654 64.8737 65.8752 83.5215 82.3099 43.0254 54.6568 2.7689
temp: 298.150 k
press: 1.00000 atm
elementType: 8 6 6 6 6 6 6 6 6 6 6 6 6 6 6 6 1 1 1 1 1 1 1 1 1 1 1 1 1 1 1 1 1 1 1 1 1 1 1 1 1 1 1 1 1 1 1 1
symmnumber: 1
zpe: 1156472.6 jmol-1
zpe.correction: 0.440477 hartree
zpe.thermalcorrener: 0.462231 hartree
zpe.thermalcorrenthalpy: 0.463175 hartree
zpe.thermalcorrgfe: 0.387416 hartree
zpe.sumelectzpe: -664.641511 hartree
zpe.sumelectthermal: -664.619757 hartree
zpe.sumelectthermalent: -664.618813 hartree
zpe.sumelectthermalfe: -664.694572 hartree
dipole: -1.7441 -0.1402 -0.3419
dipole: 1.7828
quadrupole: -88.4204 -106.4039 -104.4912
quadrupole: 3.3760 -0.9684 1.3384
quadrupole: 11.3514 -6.6321 -4.7194 3.3760 -0.9684 1.3384
hfenergy: -665.0819879 hartree
pointgroup: C01 [X(C15H32O1)]
dipole: 0.6865586 0.0551185 -0.1326041 debye
polarizability: 194.4118919|-2.1321634|159.2125083|2.5960809|-0.074166|147.7382055 unknown
InChI: InChI=1S/C15H32O/c1-13(2)7-5-8-14(3)9-6-10-15(4)11-12-16/h13-16H,5-12H2,1-4H3
charge 0 multiplicity 1
48 atoms
O  5.05184 1.478096 1.670541
C  -0.712979 -1.900798 0.738926
C  0.40952 -0.843193 0.521968
C  -2.030714 -1.580548 -0.018438
C  0.855083 -0.630657 -0.944862
C  1.939974 0.463709 -1.110716
C  3.286071 0.211133 -0.375835
C  -2.667132 -0.216601 0.337132
C  -4.050343 -0.013619 -0.32251
C  -0.226025 -3.330446 0.39441
C  -4.676101 1.391343 -0.110569
C  4.229339 1.422524 -0.604595
C  3.942311 -1.11585 -0.825808
C  5.493006 1.424516 0.261896
C  -4.956552 1.686981 1.383109
C  -5.972786 1.538157 -0.942401
H  -0.951711 -1.885068 1.825619
H  1.285133 -1.148925 1.129582
H  0.079963 0.132398 0.934728
H  -1.852641 -1.630914 -1.112798
H  -2.763744 -2.384087 0.20659
H  1.220132 -1.584686 -1.372746
H  -0.022718 -0.337547 -1.555357
H  2.151435 0.595515 -2.194152
H  1.524301 1.430156 -0.753968
H  3.095888 0.154826 0.713739
H  -1.993612 0.606495 0.021436
H  -2.758669 -0.141306 1.439739
H  -4.756637 -0.782348 0.058543
H  -3.95262 -0.196471 -1.413659
H  0.706993 -3.576894 0.93582
H  -0.987495 -4.084625 0.669109
H  -0.027565 -3.439755 -0.68843
H  -3.944963 2.144315 -0.47743
H  4.537835 1.45585 -1.67116
H  3.675758 2.35992 -0.397368
H  4.904511 -1.290975 -0.310483
H  3.294425 -1.982756 -0.602981
H  4.135368 -1.109852 -1.917139
H  6.113117 2.31319 0.015088
H  6.100206 0.512434 0.078317
H  -5.645386 0.929087 1.805361
H  -4.031226 1.678615 1.986522
H  -5.429704 2.679175 1.507204
H  -6.73242 0.802372 -0.613314
H  -5.782413 1.367628 -2.018892
H  -6.411179 2.547576 -0.829512
H  5.844224 1.511909 2.262748
