program: Gaussian 09
title: 000011485
version: EM64L-G09RevD.01
frameworkgroup: C1[X(C8H8ClNO)]
method: RPBEPBE
basis: SDD
operation: Freq
keyword: #p
keyword: freq=noraman
keyword: PBEPBE/SDD
title: #p freq=noraman PBEPBE/SDD
converged: YES YES NO NO
title: Mulliken charges:
elementType: Cl O N C C C C C C C C H H H H H H H H
charge: -0.077980 -0.249267 -0.435908 0.485460 -0.437397 -0.343654 -0.195980 -0.214164 -0.250343 0.248109 -0.667588 0.321354 0.226531 0.304805 0.229118 0.229230 0.231227 0.298242 0.298203
chargesum: 0.00000
title: Mulliken charges with hydrogens summed into heavy atoms:
elementType: Cl O N C C C C C C C C
charge: -0.077980 -0.249267 -0.114554 0.485460 -0.210866 -0.038849 0.033138 0.015066 -0.019115 0.248109 -0.071143
polarizability: 1.55996461e+02 -4.17794855e+00 1.16878346e+02 1.81425676e-02 1.33561730e-02 4.48328638e+01
1716.lowfreq: -4.4931 0.0028 0.0030 0.0031 2.6815 6.6959 42.4800 79.2182 90.3091
frequency: 42.4782 79.2105 90.2989 109.0358 199.7010 257.8243 327.9211 382.0550 407.4076 460.2652 500.8808 569.2387 613.4841 652.1077 676.9757 696.9722 728.1696 775.9810 842.3273 846.8484 903.3054 922.8701 940.7743 976.1096 986.0340 1001.5893 1027.8599 1091.3826 1149.3717 1174.0260 1189.7708 1209.5770 1255.6954 1264.4064 1327.5837 1388.0547 1418.0299 1437.6150 1486.5707 1535.3086 1604.7611 1606.5501 1617.0316 3070.6946 3116.8219 3134.8512 3147.2931 3153.0563 3166.9688 3193.1095 3457.7368
redmass: 4.5301 4.8199 3.1483 8.9577 7.9598 3.8728 7.7672 9.8482 2.9058 6.5311 2.9182 3.1031 6.4601 5.9702 6.5236 1.8462 1.2294 1.6227 5.5878 1.2611 1.7187 1.4380 6.4790 1.3576 6.2170 1.3103 2.1203 1.5518 1.1113 1.0525 1.1230 3.8749 1.2161 1.9106 1.4074 7.8592 1.1172 2.2860 2.3591 2.1574 5.1854 5.6461 6.4724 1.0564 1.0884 1.0871 1.0936 1.1095 1.0998 1.0954 1.0763
irintensity: 1.3923 12.5728 4.1502 0.5735 11.1978 0.8211 2.1598 2.5375 0.0167 26.5895 17.7378 3.3635 0.5793 1.5142 85.9917 33.8020 28.1817 122.6197 2.2820 0.6234 11.0885 16.3090 0.9175 0.0711 0.1668 2.7129 6.6136 15.9197 0.4787 0.7103 0.5247 6.0296 20.1356 7.6804 23.4241 26.0224 38.1373 48.5628 45.4684 361.8910 93.9460 192.1219 22.5508 4.1686 10.5864 0.8615 28.3430 0.8347 21.6180 5.6374 69.6367
temp: 298.150 k
press: 1.00000 atm
elementType: 17 8 7 6 6 6 6 6 6 6 6 1 1 1 1 1 1 1 1
symmnumber: 1
zpe: 378103.6 jmol-1
zpe.correction: 0.144012 hartree
zpe.thermalcorrener: 0.153966 hartree
zpe.thermalcorrenthalpy: 0.154910 hartree
zpe.thermalcorrgfe: 0.106998 hartree
zpe.sumelectzpe: -898.907270 hartree
zpe.sumelectthermal: -898.897316 hartree
zpe.sumelectthermalent: -898.896372 hartree
zpe.sumelectthermalfe: -898.944284 hartree
dipole: 0.4758 -1.7798 0.0043
dipole: 1.8423
quadrupole: -63.4320 -72.7243 -74.2885
quadrupole: -3.0116 0.0003 0.0097
quadrupole: 6.7163 -2.5760 -4.1403 -3.0116 0.0003 0.0097
hfenergy: -899.0512823 hartree
pointgroup: C01 [X(C8H8Cl1N1O1)]
dipole: -0.3406293 0.6023483 0.2156779 debye
dipolederiv: -0.3553382 -0.0882315 0.0014987 -0.3406342 -0.6127674 -0.0803812 -0.0688386 -0.1141525 -0.1830211 -0.7472507 -0.1974542 -0.0020243 0.5105038 -0.8876426 -0.2182777 0.1950568 -0.1232272 -0.412348 -1.6283659 0.0987957 0.2083966 0.2557526 -0.4279512 -0.0742737 0.2510984 -0.0527002 -0.3323916 1.0850688 0.1015503 -0.1047399 0.2736575 0.0729356 -0.0447123 -0.0565077 -0.0217052 0.1025248 -0.2561022 0.0017102 0.0075603 0.1100698 0.0238878 0.0482051 0.0379513 0.0628235 -0.1902732 -0.2293358 -0.0371114 -0.001305 -0.1756218 -0.1074183 0.0390137 -0.0397539 0.0201776 -0.1517952 0.077276 -0.0231547 -0.0359931 -0.1005041 0.0809054 0.0753833 -0.0577349 0.0650142 -0.1147279 0.0356047 0.0335883 -0.0150794 0.1002962 0.1474923 0.0677287 0.0034894 0.0766949 -0.1233584 -0.0096136 0.0406563 -0.011377 0.0326273 -0.1257381 0.0101817 -0.0132787 0.0092097 -0.1737907 1.5231792 0.1032019 -0.1500395 -1.0060444 0.8937266 0.3325882 -0.4585142 0.1835903 0.2995539 -0.0183238 -0.0208288 0.0168273 0.3316938 0.7548464 0.123285 0.1151397 0.1703974 0.1842307 0.3140377 0.0809089 0.0195315 0.0940886 0.192405 -0.0401012 0.0230975 -0.0385151 0.2770036 0.043234 -0.1019505 -0.0112843 -0.0822805 -0.057744 -0.0522224 -0.0057285 -0.0495679 0.1566277 0.1373178 0.0679327 0.0251253 0.0430993 0.0902696 -0.0316247 0.0181404 -0.0349224 0.1710143 -0.0050967 0.0852997 0.0459368 0.1029082 -0.0159213 -0.0626046 0.0508555 -0.0602689 0.1350419 0.0512888 -0.0597292 -0.0027012 -0.0833679 -0.0776417 -0.0533675 -0.0092536 -0.0565018 0.1399439 -0.1207571 -0.0456311 0.0264065 -0.0445465 0.0891301 -0.016293 0.0266044 -0.016198 0.1610447 0.0682008 -0.0337222 0.0331403 -0.0387027 -0.0018631 -0.0452674 0.0738856 -0.0195308 -0.0037887 0.0349762 -0.0058307 -0.0498794 0.0170049 -0.0309111 0.0227399 -0.085709 -0.0006175 0.0585091 unknown
polarizability: 153.9516188|8.626106|112.3455213|-12.2980731|17.6546937|51.4105306 unknown
InChI: InChI=1S/C8H8ClNO/c9-6-8(11)10-7-4-2-1-3-5-7/h1-5,10H,6H2
charge 0 multiplicity 1
19 atoms
Cl 3.302029 2.299033 0.035226
O  1.798734 -1.402111 -0.795994
N  0.783917 0.614727 -0.098003
C  -0.595951 0.261432 -0.009806
C  -1.500192 1.279096 0.396046
C  -1.078848 -1.040492 -0.307214
C  -2.87706 0.999798 0.504539
C  -2.46151 -1.302383 -0.193212
C  -3.366756 -0.294406 0.210121
C  1.847599 -0.178117 -0.461013
C  3.238998 0.46614 -0.466531
H  1.023194 1.584761 0.140787
H  -1.125193 2.284838 0.625452
H  -0.37874 -1.818206 -0.617791
H  -3.565557 1.791785 0.818566
H  -2.831653 -2.307717 -0.423054
H  -4.436718 -0.511838 0.2939
H  3.662447 0.41738 -1.480248
H  3.891159 -0.062419 0.243828
