program: Gaussian 09
title: 000138789
version: EM64L-G09RevD.01
frameworkgroup: C1[X(C7H6BrCl)]
method: RPBEPBE
basis: SDD
operation: Freq
keyword: #p
keyword: freq=noraman
keyword: PBEPBE/SDD
title: #p freq=noraman PBEPBE/SDD
converged: NO YES NO NO
title: Mulliken charges:
elementType: Br Cl C C C C C C C H H H H H H
charge: 0.045175 -0.016218 0.470592 -0.359878 -0.395785 -0.797489 -0.046716 -0.168147 -0.190606 0.263327 0.241887 0.230633 0.228336 0.242079 0.252811
chargesum: 0.00000
title: Mulliken charges with hydrogens summed into heavy atoms:
elementType: Br Cl C C C C C C C
charge: 0.045175 -0.016218 0.470592 -0.096551 -0.153898 -0.096441 -0.046716 0.084663 -0.190606
polarizability: 1.45970486e+02 5.55482974e+00 1.03378851e+02 -4.54681771e-01 9.37546814e-02 4.11270813e+01
1716.lowfreq: -8.4075 -7.3985 0.0025 0.0027 0.0031 1.7564 19.0336 92.3351 152.7452
frequency: 18.4406 92.3329 152.7450 170.7507 220.9378 287.1117 290.6099 402.8799 424.9715 436.9653 544.9262 578.7216 668.5137 692.6278 815.5077 839.1990 876.8317 957.2472 991.5049 1000.4580 1047.5805 1109.3931 1145.5395 1217.9232 1258.0008 1357.8138 1378.1823 1399.6796 1456.1024 1469.5488 1473.4611 1566.7109 1595.8267 2979.9453 3062.3645 3091.7200 3139.0200 3150.1910 3168.4373
redmass: 1.0202 4.5370 28.9957 4.7476 5.1077 6.0606 4.7833 5.6560 5.1953 3.0551 4.0929 5.6464 7.1474 3.6237 1.2983 5.4700 1.3624 1.3448 3.1255 1.7945 1.5500 2.2349 1.4178 2.1150 1.5623 5.4423 3.2892 1.2206 2.7793 1.0981 1.0550 6.3524 6.5168 1.0388 1.0950 1.1000 1.0892 1.0923 1.0962
irintensity: 0.5744 0.3470 0.2057 1.4450 0.3409 1.7783 0.1816 3.8904 3.1046 11.2308 8.0866 10.6106 11.7931 0.6152 40.7126 30.7142 8.6037 0.5599 34.5922 7.6813 20.1214 31.4263 1.5043 5.4855 4.9839 3.6961 10.2535 12.4825 72.3345 26.5200 14.4319 13.9041 3.9452 28.2827 19.5343 16.0870 8.7474 2.7992 5.4344
temp: 298.150 k
press: 1.00000 atm
elementType: 35 17 6 6 6 6 6 6 6 1 1 1 1 1 1
symmnumber: 1
zpe: 278315.5 jmol-1
zpe.correction: 0.106005 hartree
zpe.thermalcorrener: 0.115079 hartree
zpe.thermalcorrenthalpy: 0.116023 hartree
zpe.thermalcorrgfe: 0.069069 hartree
zpe.sumelectzpe: -743.213415 hartree
zpe.sumelectthermal: -743.204341 hartree
zpe.sumelectthermalent: -743.203397 hartree
zpe.sumelectthermalfe: -743.250352 hartree
dipole: -3.3057 -1.3956 0.0587
dipole: 3.5887
quadrupole: -59.3378 -65.3404 -72.0596
quadrupole: -0.1108 -0.2321 0.0038
quadrupole: 6.2414 0.2389 -6.4803 -0.1108 -0.2321 0.0038
hfenergy: -743.3194202 hartree
pointgroup: C01 [X(C7H6Br1Cl1)]
dipole: 1.3716635 0.3341919 0.0179852 debye
dipolederiv: -0.596977 0.1556691 0.0030171 0.1768733 -0.0539955 -0.0006942 0.0044455 -0.0012329 -0.0043075 -0.3237266 -0.3098239 0.0013372 -0.3346019 -0.4927466 0.0007382 0.001076 -0.0015408 -0.0450705 0.4161143 -0.091838 0.016363 -0.0685422 0.0566187 -0.0035155 0.0842452 -0.0161674 -0.0183432 -0.2809617 -0.1284343 0.0012092 -0.098242 -0.1161165 -0.0072562 -0.0074712 -0.0053113 -0.1229123 -0.1142886 0.071363 0.0011941 0.1055554 0.0122797 0.0067736 -0.0059123 0.0066411 -0.1750425 -0.1408026 0.0482696 -0.0124578 0.0503144 0.0454906 0.0019111 -0.1192483 0.0234882 0.0586811 0.226821 0.6453717 0.0015917 0.4404916 0.7079445 0.0038181 -0.0051295 0.0030653 -0.0146532 -0.239256 0.082153 0.0016355 0.0433455 0.0344193 -0.0054668 -0.0057544 -0.0006641 -0.0780131 0.9453446 -0.4615535 -0.0113423 -0.3114766 -0.1280493 0.0018486 -0.0078509 0.0016889 -0.1213268 0.0559317 0.0548839 0.0037295 0.0480519 -0.0251959 0.000044 0.0062072 -0.0042456 0.1593328 -0.0337118 -0.0943655 0.0036961 -0.0842573 -0.0047005 -0.0016368 0.0074696 0.0023266 0.1596467 0.0455403 0.0002415 -0.0006351 0.0762464 -0.0683972 -0.1062009 0.0606198 -0.0946486 0.0587286 -0.0087797 -0.0414579 0.0389169 -0.1190321 -0.0366756 0.0871838 0.0826161 0.0568439 0.0732026 -0.0236061 0.0282091 -0.0495665 0.0328249 0.1088883 0.0222586 -0.0985874 0.029061 -0.0901031 0.0723582 0.041312 0.0013114 0.0424489 -0.0397638 0.0001944 0.0032746 0.0006956 0.1601805 unknown
polarizability: 146.637299|-1.4458551|102.7142137|-0.0381086|0.0210076|41.124906 unknown
InChI: InChI=1S/C7H6BrCl/c1-5-2-3-6(8)7(9)4-5/h2-4H,1H3
charge 0 multiplicity 1
15 atoms
Br -3.020248 1.024524 0.021574
Cl -1.854171 -2.167136 0.001814
C  1.663521 -0.049423 -0.015648
C  0.694387 -1.082414 -0.013287
C  1.209759 1.294329 -0.011985
C  3.144316 -0.381906 0.002094
C  -0.68347 -0.781902 0.000289
C  -0.168215 1.598559 0.001157
C  -1.124404 0.559471 0.007588
H  1.005866 -2.132238 -0.022157
H  1.936413 2.114431 -0.020636
H  3.356475 -1.320596 -0.538636
H  3.74296 0.422674 -0.458876
H  3.508095 -0.510685 1.039882
H  -0.507083 2.638614 0.002329
