program: Gaussian 09
title: 000138769
version: EM64L-G09RevD.01
frameworkgroup: C1[X(C2H5P)]
method: RPBEPBE
basis: SDD
operation: Freq
keyword: #p
keyword: freq=noraman
keyword: PBEPBE/SDD
title: #p freq=noraman PBEPBE/SDD
converged: NO NO NO NO
title: Mulliken charges:
elementType: P C C H H H H H
charge: 0.531534 -0.975498 -0.827821 0.261529 0.249784 0.261531 0.255306 0.243635
chargesum: 0.00000
title: Mulliken charges with hydrogens summed into heavy atoms:
elementType: P C C
charge: 0.531534 -0.202654 -0.328880
polarizability: 5.82531762e+01 -6.12027089e+00 4.43343971e+01 -7.10148250e-05 -1.64615699e-04 2.58409520e+01
1716.lowfreq: -89.5393 -7.8572 0.0007 0.0041 0.0048 6.2823 39.8946 287.5145 588.7898
frequency: -88.0039 287.5129 588.7876 635.4508 845.4844 870.8360 891.5801 929.9262 983.4924 1319.6388 1416.6642 1450.5917 1460.5153 2988.1173 3082.4089 3093.2548 3107.3809 3206.0977
redmass: 1.0936 2.4758 1.0227 5.6065 1.1954 1.2612 1.2390 3.0734 1.6741 1.1550 1.1515 1.0529 1.0527 1.0324 1.0566 1.1005 1.0999 1.1128
irintensity: 0.0000 0.6862 0.3927 11.6521 1.8396 84.2178 52.5500 9.0460 22.2625 9.8883 10.8037 5.3706 15.3020 15.7334 7.8607 15.2738 15.0461 6.0519
temp: 298.150 k
press: 1.00000 atm
elementType: 15 6 6 1 1 1 1 1
symmnumber: 1
zpe: 162439.4 jmol-1
zpe.correction: 0.061870 hartree
zpe.thermalcorrener: 0.065745 hartree
zpe.thermalcorrenthalpy: 0.066689 hartree
zpe.thermalcorrgfe: 0.035925 hartree
zpe.sumelectzpe: -420.158812 hartree
zpe.sumelectthermal: -420.154937 hartree
zpe.sumelectthermalent: -420.153992 hartree
zpe.sumelectthermalfe: -420.184757 hartree
dipole: 0.5036 1.2800 0.0000
dipole: 1.3756
quadrupole: -24.7065 -27.7727 -28.0010
quadrupole: -0.4977 0.0000 0.0000
quadrupole: 2.1202 -0.9460 -1.1743 -0.4977 0.0000 0.0000
hfenergy: -420.2206816 hartree
pointgroup: C01 [X(C2H5P1)]
dipole: -0.177152 -0.5113739 -0.0000061 debye
dipolederiv: 0.3280449 0.1344659 0.0000036 0.2283027 0.3404888 0.0000038 -0.0000004 0.0000097 0.0373801 -0.1668635 -0.0574779 -0.0000015 -0.2948016 -0.2266012 -0.0000018 0.0000089 -0.0000068 -0.0127751 -0.1203982 -0.067088 -0.0000005 0.0808322 -0.1410577 0.0000057 0.0000046 0.0000011 -0.5432553 0.0266798 -0.0254782 0.0111628 -0.0623739 0.0082722 -0.1111824 -0.0220363 -0.0994364 -0.0311466 -0.0758134 0.0925814 -0.0000144 0.1111239 0.0360942 0.000013 -0.0000201 0.0000093 0.11696 0.0266846 -0.0254915 -0.0111457 -0.062382 0.0083059 0.1111676 0.0220457 0.0994309 -0.0311722 -0.0802746 -0.0474305 -0.0000031 -0.0193764 0.0886095 -0.0000007 0. -0.0000006 0.1912081 0.0619404 -0.0040813 -0.0000013 0.0186751 -0.1141117 -0.0000053 -0.0000024 -0.0000073 0.2728011 unknown
polarizability: 58.7351453|-5.5242194|43.852428|0.0000641|0.0001674|25.840952 unknown
InChI: InChI=1S/C2H5P/c1-3-2/h1H2,2H3
charge 0 multiplicity 1
8 atoms
P  0.113554 0.748472 0.000006
C  -1.454803 -0.34946 -0.00002
C  1.360175 -0.426945 -0.000001
H  -1.489349 -0.992705 -0.897641
H  -2.346756 0.299205 -0.00011
H  -1.489451 -0.992601 0.897675
H  2.40676 -0.102922 0.000007
H  1.186971 -1.511944 -0.000016
