program: Gaussian 09
title: 000138748
version: EM64L-G09RevD.01
frameworkgroup: C1[X(C10H12O3)]
method: RPBEPBE
basis: SDD
operation: Freq
keyword: #pfreq=noraman
keyword: PBEPBE/SDD
title: #p freq=noraman PBEPBE/SDD
converged: YES YES NO NO
title: Mulliken charges:
elementType: O O O C C C C C C C C C C H H H H H H H H H H H H
charge: -0.229520 -0.244589 -0.176684 0.283163 0.190731 -0.411671 -0.314485 -0.331982 -0.260395 -0.251178 0.221238 -0.759710 -0.538374 0.264367 0.221318 0.226659 0.241490 0.222753 0.223097 0.263828 0.230906 0.244923 0.216711 0.221714 0.245690
chargesum: 0.00000
title: Mulliken charges with hydrogens summed into heavy atoms:
elementType: O O O C C C C C C C C C C
charge: -0.229520 -0.244589 -0.176684 0.283163 0.190731 0.074014 -0.087827 -0.090492 -0.037642 -0.028081 0.221238 -0.020053 0.145741
polarizability: 1.49209024e+02 1.36768639e+00 1.27720266e+02 -1.26591938e+01 2.48286700e+00 7.60195043e+01
1716.lowfreq: -11.1414 -4.3860 -0.0005 -0.0004 0.0002 10.0472 31.4725 50.6273 66.6728
frequency: 31.1569 50.6035 66.6687 87.8058 97.3266 146.0802 171.9866 221.1771 257.8783 266.5625 298.6990 315.6117 410.4534 451.3499 457.4746 470.3290 542.3341 558.8119 571.4613 619.1861 719.6760 724.5463 736.8912 787.2389 795.5155 822.5614 856.4453 895.3836 948.1608 953.0397 985.3421 1025.7193 1046.3387 1066.7201 1111.0938 1118.1862 1148.3978 1162.9336 1173.2561 1196.5981 1238.7686 1256.3046 1276.2349 1334.0639 1371.2294 1397.3071 1425.3642 1434.2303 1442.4087 1444.9613 1457.7435 1467.1498 1471.5253 1494.3957 1594.3865 1604.1940 1657.6034 2946.5258 2955.5628 2982.3345 3042.0501 3042.1426 3070.2345 3118.2780 3124.4597 3133.5284 3146.3594 3159.7679 3172.8475
redmass: 4.9866 3.2712 4.2433 1.1366 3.3794 4.0317 3.9611 2.2075 1.9257 2.7691 3.0537 3.7107 4.1637 2.3100 3.0693 4.8886 4.1566 3.9535 6.7489 4.5306 4.7983 3.3564 1.2499 4.3581 4.4436 1.5671 1.4327 1.3822 2.3194 1.3024 8.5284 4.7181 2.0743 2.0713 1.2611 2.0683 1.6131 1.9794 1.0935 2.4274 1.6151 2.0612 1.4693 1.3872 1.2139 9.0917 1.4743 1.1125 1.5117 1.0914 1.0620 1.0507 1.1050 2.4721 6.2834 7.4660 8.7669 1.0651 1.0332 1.0380 1.1029 1.0944 1.0954 1.1003 1.0990 1.0845 1.0894 1.0936 1.0999
irintensity: 4.8074 3.9646 2.6076 0.0594 7.0574 1.0527 5.1083 0.7457 0.5911 2.4524 2.2996 2.9406 2.9518 0.3551 2.0313 4.3513 13.0896 0.0975 5.5393 5.6689 16.3274 0.7205 113.0310 1.1695 7.0026 0.7272 3.3775 2.6758 31.3301 0.2465 38.5724 25.4064 20.4456 6.3157 0.2112 156.1955 58.4875 80.3984 2.7363 62.1064 74.9411 123.2482 10.1911 23.3862 56.8430 1.1676 12.9895 12.5954 27.8111 27.6770 18.2430 13.3737 64.0981 123.3498 54.8957 12.3699 94.9976 51.4265 66.8947 5.3016 42.9567 19.5410 16.5474 9.3996 23.0139 0.6534 20.6223 34.8563 11.2478
temp: 298.150 k
press: 1.00000 atm
elementType: 8 8 8 6 6 6 6 6 6 6 6 6 6 1 1 1 1 1 1 1 1 1 1 1 1
symmnumber: 1
zpe: 518156.3 jmol-1
zpe.correction: 0.197355 hartree
zpe.thermalcorrener: 0.210638 hartree
zpe.thermalcorrenthalpy: 0.211582 hartree
zpe.thermalcorrgfe: 0.156321 hartree
zpe.sumelectzpe: -612.914010 hartree
zpe.sumelectthermal: -612.900727 hartree
zpe.sumelectthermalent: -612.899783 hartree
zpe.sumelectthermalfe: -612.955044 hartree
dipole: 0.6981 0.6766 -2.4739
dipole: 2.6581
quadrupole: -50.8606 -72.8672 -83.0956
quadrupole: 3.4382 -10.2251 0.2373
quadrupole: 18.0805 -3.9260 -14.1544 3.4382 -10.2251 0.2373
hfenergy: -613.1113651 hartree
pointgroup: C01 [X(C10H12O3)]
dipole: 0.2539431 0.3366972 -0.9569544 debye
dipolederiv: -1.4681304 0.4487818 0.1386419 0.643114 -0.5389864 -0.13431 0.2578643 -0.1264236 -0.2986534 -0.5811905 -0.4646626 0.0213009 -0.6670944 -1.3415405 0.0377286 0.0099656 -0.0092912 -0.2715843 -0.6270905 -0.0511335 0.0753244 -0.0415347 -0.2717542 0.0072578 0.0449976 0.0600166 -0.7779476 0.8915742 -0.7234705 -0.1592062 -0.9362746 0.3300789 0.1380879 -0.1835977 0.1535333 0.1305874 -0.0836662 0.4313316 0.0541828 0.5866974 1.2481058 0.0003192 0.0851264 0.0147508 0.0468009 0.8517152 -0.1896223 -0.1804018 0.0325864 0.1933772 -0.1583615 -0.3368706 -0.0424112 -0.0047261 -0.0205061 -0.0494748 -0.0016911 0.2871591 -0.068777 -0.0208495 0.0144017 0.0413603 -0.1856807 0.0340894 0.1405502 -0.0330062 -0.1914606 -0.1769745 0.0250319 -0.0662547 -0.0278703 -0.1882074 -0.0242234 0.115202 -0.0278091 -0.0917493 -0.0004473 0.0311046 -0.0456577 0.0047379 -0.1716153 0.0132197 -0.098664 -0.0485066 0.1107786 -0.0070713 0.005572 -0.031996 0.0337562 -0.1688988 1.0502559 0.2554604 -0.017291 0.2682178 0.1447651 0.0450785 0.0906925 -0.0588741 0.8941512 -0.5337913 -0.144433 0.0769191 -0.2640055 -0.0427893 0.08184 -0.0038879 0.0629149 -0.0313768 0.6631203 0.4398902 -0.0241451 0.1828781 0.4078872 -0.0309767 -0.0547638 -0.0901598 0.330303 -0.0489119 0.0757563 0.0242964 0.0975896 0.0067223 -0.0712313 0.0418038 -0.0362885 0.0866992 -0.038134 0.0003582 -0.0057454 -0.1309191 -0.0101517 0.1604396 0.0443587 0.0592563 -0.0012157 -0.1265056 -0.0511789 0.042199 -0.0682773 0.0892029 -0.0052243 0.0435424 -0.0051855 0.1432928 -0.0805835 -0.0691718 0.0409062 -0.0702397 0.0766493 0.0059737 0.0419163 0.007157 0.158133 0.068985 -0.057717 0.0130129 -0.0333607 -0.1192203 -0.0159352 0.0170925 -0.017607 0.1621862 -0.0258706 0.1086858 0.0456583 0.0947917 -0.0206033 -0.0344173 0.0489468 -0.0371434 0.1543492 -0.0107421 0.0168153 -0.0568385 0.0325731 0.1246677 0.0217329 -0.1019409 0.0346111 -0.0048647 0.0811646 -0.0102451 0.0354627 0.056234 0.0628938 -0.107787 0.0662851 -0.0948409 -0.0532109 0.1019878 0.047353 0.0066014 0.0100265 -0.0654613 0.0361332 0.0119188 0.031537 0.1113827 -0.1303377 -0.0756087 -0.084929 0.1022213 0.0549383 0.0853905 -0.0998109 0.0579946 -0.0415127 -0.0385145 -0.0989034 0.0565465 0.0445415 0.0754651 -0.0917837 0.1021421 0.0066326 -0.1373122 0.0820862 0.0041009 0.0085175 -0.0544933 -0.1509765 -0.0108139 0.0037256 -0.0221633 0.1189211 unknown
polarizability: 148.8409589|3.2929763|127.5507954|-13.0472708|4.7633053|76.5570394 unknown
InChI: InChI=1S/C10H12O3/c1-8(11)7-13-10-6-4-3-5-9(10)12-2/h3-6H,7H2,1-2H3
charge 0 multiplicity 1
25 atoms
O  0.666533 -0.94512 -0.563772
O  -1.815916 -1.723138 -0.120225
O  2.498208 -0.254373 1.500667
C  -0.246823 0.083491 -0.271044
C  -1.593052 -0.34335 -0.040157
C  2.029659 -0.581456 -0.889096
C  0.069962 1.455953 -0.212971
C  -2.587429 0.619839 0.241867
C  -0.934938 2.413811 0.067585
C  -2.259729 1.996606 0.293816
C  2.913102 -0.211284 0.319423
C  4.33443 0.213783 -0.040706
C  -3.172307 -2.196986 0.158797
H  2.458767 -1.488052 -1.356151
H  2.076512 0.23429 -1.643969
H  1.100408 1.794339 -0.358367
H  -3.619824 0.305461 0.421319
H  -0.670663 3.475241 0.115835
H  -3.041726 2.730415 0.515408
H  5.012061 0.003821 0.8020
H  4.702922 -0.285729 -0.954408
H  4.35369 1.305692 -0.226761
H  -3.901237 -1.796371 -0.573361
H  -3.491377 -1.926812 1.184622
H  -3.114931 -3.291175 0.063946
