program: Gaussian 09
title: 000138746
version: EM64L-G09RevD.01
frameworkgroup: C1[X(C13H14N2O2)]
method: RPBEPBE
basis: SDD
operation: Freq
keyword: #p
keyword: freq=noraman
keyword: PBEPBE/SDD
title: #p freq=noraman PBEPBE/SDD
converged: YES YES NO NO
title: Mulliken charges:
elementType: O O N N C C C C C C C C C C C C C H H H H H H H H H H H H H H
charge: -0.476538 -0.476522 -0.701586 -0.701578 -0.755170 0.579577 0.579220 -0.562179 -0.558485 -0.423209 -0.426659 0.356378 0.356594 -0.351635 -0.351860 0.114066 0.114313 0.206409 0.209779 0.212967 0.213045 0.220185 0.220005 0.207261 0.207300 0.299026 0.336795 0.299111 0.336760 0.358314 0.358315
chargesum: 0.00000
title: Mulliken charges with hydrogens summed into heavy atoms:
elementType: O O N N C C C C C C C C C C C C C
charge: -0.118223 -0.118207 -0.065765 -0.065707 -0.338981 0.579577 0.579220 -0.349212 -0.345440 -0.203025 -0.206654 0.356378 0.356594 -0.144374 -0.144561 0.114066 0.114313
polarizability: 2.03880330e+02 -1.06091049e+00 1.80174250e+02 -2.38718041e-01 1.04929520e+01 1.10419239e+02
1716.lowfreq: -22.2142 -11.1042 -0.0008 -0.0002 0.0007 3.9895 7.4807 29.4152 37.7854
frequency: -21.8507 29.2010 37.7171 113.4091 156.5640 196.3449 203.2155 225.7086 293.7426 294.7761 298.4774 300.3840 306.3198 320.0409 324.6099 354.1429 359.1357 428.8833 429.8193 434.4232 445.3561 476.7754 477.7041 502.2501 503.2119 567.2289 569.8746 600.5044 643.3685 711.9062 720.6185 739.2539 744.8790 754.7844 755.0146 774.1073 802.7077 848.1405 874.7919 887.8832 895.2184 910.3776 951.8694 957.9599 1035.3174 1044.2959 1087.4302 1092.1537 1144.9016 1148.3326 1157.5074 1169.0621 1180.1381 1231.4520 1232.7740 1288.6974 1304.9726 1308.1123 1319.8815 1322.2504 1411.5737 1415.6875 1449.9254 1452.8241 1469.8581 1514.8825 1518.3263 1606.8337 1610.6897 1613.9506 1614.1223 1636.8557 1639.2945 2986.8559 3042.4373 3106.5492 3107.3275 3108.7668 3112.9105 3142.5232 3145.0269 3568.5607 3568.8911 3608.3184 3608.4924 3716.7351 3716.8342
redmass: 4.0743 4.7218 5.9343 6.3535 5.8027 4.7355 4.2341 4.1641 1.1735 2.2300 1.2275 3.8551 1.4781 1.5940 2.2815 2.9106 2.7232 3.0522 2.6026 4.1625 2.8385 1.1102 1.1109 4.5082 4.6042 5.7624 5.0295 4.0866 5.1136 3.8961 3.3240 4.9992 2.2470 5.1153 4.6222 1.4166 1.7204 1.6176 1.8333 1.3509 1.4337 2.0406 2.9852 2.6748 1.6587 1.6770 1.7012 1.7258 1.2830 1.5146 1.1122 1.4587 1.7748 2.1259 2.1438 1.3558 1.3531 1.3772 3.1794 3.1924 7.2263 5.5801 4.0190 3.5427 1.1025 3.7051 3.6910 3.9657 2.9776 1.8711 1.6833 3.3584 3.3845 1.0598 1.1021 1.0882 1.0883 1.0908 1.0908 1.0953 1.0951 1.0442 1.0443 1.0662 1.0662 1.1046 1.1046
irintensity: 0.0089 0.1190 0.4326 1.6036 0.9822 0.9603 5.4120 24.2284 115.2596 25.3887 132.0205 23.0355 51.0576 202.9281 0.3362 69.7713 146.7964 8.6265 10.5914 0.0114 8.3522 77.3169 90.0402 3.5532 10.3248 0.4818 0.8786 6.8530 21.4320 16.6665 0.4235 0.0210 39.0373 12.8282 0.2448 36.1260 13.6641 20.5123 43.2637 0.3466 0.5030 7.3013 0.9899 10.0529 2.0153 1.4111 401.0949 132.6573 23.1512 20.6504 6.4355 27.1939 21.0663 23.4600 8.8438 10.2693 4.0490 29.6947 76.1258 64.0177 0.4475 1.9695 28.9166 0.6970 18.1803 195.5582 89.7684 0.9042 14.9857 22.9136 10.7775 96.2780 406.7744 44.3442 13.8770 34.5064 24.7740 1.2786 32.3756 0.5495 22.2162 64.0832 96.2576 50.7150 27.2434 33.1135 30.1548
temp: 298.150 k
press: 1.00000 atm
elementType: 8 8 7 7 6 6 6 6 6 6 6 6 6 6 6 6 6 1 1 1 1 1 1 1 1 1 1 1 1 1 1
symmnumber: 1
zpe: 644697.7 jmol-1
zpe.correction: 0.245552 hartree
zpe.thermalcorrener: 0.260889 hartree
zpe.thermalcorrenthalpy: 0.261833 hartree
zpe.thermalcorrgfe: 0.203556 hartree
zpe.sumelectzpe: -762.515217 hartree
zpe.sumelectthermal: -762.499880 hartree
zpe.sumelectthermalent: -762.498936 hartree
zpe.sumelectthermalfe: -762.557214 hartree
dipole: -0.0041 0.6608 -1.0570
dipole: 1.2465
quadrupole: -87.2100 -79.1322 -98.5501
quadrupole: -0.3715 -0.0729 9.4795
quadrupole: 1.0874 9.1652 -10.2526 -0.3715 -0.0729 9.4795
hfenergy: -762.7607696 hartree
pointgroup: C01 [X(C13H14N2O2)]
dipole: -0.0010667 0.2471254 -0.4235963 debye
polarizability: 203.8710576|-1.1508553|180.7594448|-0.2685786|8.3424934|109.8433163 unknown
InChI: InChI=1S/C13H14N2O2/c14-10-6-8(1-3-12(10)16)5-9-2-4-13(17)11(15)7-9/h1-4,6-7,16-17H,5,14-15H2
charge 0 multiplicity 1
31 atoms
O  -4.784407 0.165053 -1.399322
O  4.792431 0.143006 -1.390978
N  -3.645246 2.224103 -0.094339
N  3.613404 2.222642 -0.156268
C  -0.000743 -0.738167 1.717239
C  -1.281596 -0.534895 0.902728
C  1.283168 -0.540317 0.905948
C  -1.869824 0.750184 0.80147
C  1.853342 0.749816 0.770886
C  -1.882796 -1.62125 0.222956
C  1.905169 -1.637324 0.263143
C  -3.037028 0.977108 0.027761
C  3.022759 0.970936 -0.00098
C  -3.049889 -1.418143 -0.553528
C  3.075137 -1.440041 -0.510827
C  -3.615847 -0.136658 -0.650855
C  3.622937 -0.153817 -0.642127
H  -0.000831 -0.039073 2.575653
H  -0.002686 -1.760942 2.138632
H  -1.414614 1.596947 1.331919
H  1.381019 1.605327 1.271365
H  -1.44426 -2.622649 0.293003
H  1.481797 -2.642909 0.361058
H  -3.515646 -2.263478 -1.078164
H  3.557335 -2.293533 -1.006619
H  -3.25648 3.04389 0.359134
H  -4.480456 2.310003 -0.666696
H  3.207631 3.050105 0.267398
H  4.45099 2.304035 -0.725799
H  -5.122553 -0.64176 -1.857218
H  5.145783 -0.671798 -1.822473
