program: Gaussian 09
title: 000138728
version: EM64L-G09RevD.01
frameworkgroup: C1[X(C6H8N2OS)]
method: RPBEPBE
basis: SDD
operation: Freq
keyword: #p
keyword: freq=noraman
keyword: PBEPBE/SDD
title: #p freq=noraman PBEPBE/SDD
converged: YES YES NO NO
title: Mulliken charges:
elementType: S O N N C C C C C C H H H H H H H H
charge: 0.173860 -0.226187 -0.092063 0.001677 -0.163441 -0.112547 -0.602753 -0.293280 0.012498 -0.819945 0.244902 0.224240 0.264526 0.264356 0.253113 0.342963 0.263939 0.264142
chargesum: 0.00000
title: Mulliken charges with hydrogens summed into heavy atoms:
elementType: S O N N C C C C C C
charge: 0.173860 -0.226187 -0.092063 0.001677 -0.163441 0.132355 0.150369 -0.040166 0.012498 0.051099
polarizability: 1.36011385e+02 -4.98798998e+00 1.17352144e+02 -1.91703710e-02 4.78306950e-02 4.75605714e+01
1716.lowfreq: -2.1677 -0.0020 -0.0017 0.0030 11.2343 13.0079 74.3531 81.1358 95.7572
frequency: 74.2847 81.0788 95.7564 152.4603 166.5351 180.4019 242.3757 285.6473 351.2087 396.7596 423.4230 463.0605 529.2031 614.7293 656.5650 679.6571 726.4290 750.5400 815.3470 858.9323 947.3772 977.5858 990.1685 1015.8632 1066.1844 1117.7426 1125.9682 1188.7020 1230.5648 1332.9544 1342.0470 1387.3921 1445.7079 1449.4618 1461.5163 1475.3448 1481.9080 1493.4547 1602.8833 1637.1490 2983.7353 2995.9260 3084.5405 3115.7389 3118.3966 3157.1473 3163.0563 3196.6608
redmass: 3.2761 2.5595 1.3040 2.3588 1.5643 4.0838 3.8891 3.6988 6.8319 5.6629 3.5405 8.0090 4.8933 6.0360 8.3077 9.1032 3.5873 6.2816 1.8058 7.1378 1.3017 2.7797 1.1600 1.2527 3.1541 1.3062 1.8911 1.5352 5.2543 1.1659 1.9072 2.5709 1.1853 1.0569 1.0397 1.0556 2.0139 1.8433 9.0177 7.3731 1.0346 1.0340 1.1026 1.0959 1.1012 1.1071 1.0902 1.0986
irintensity: 7.6230 0.7583 2.3489 0.0656 1.2027 9.9852 2.5515 0.9839 8.3771 14.9699 1.2514 3.0981 2.1787 2.4103 1.8474 14.1165 0.2118 0.7386 59.5541 4.1893 0.5730 8.2701 3.9990 38.2262 100.0621 1.0955 45.5722 17.9502 69.9994 15.4731 139.1302 70.7580 7.1017 4.3244 14.8228 18.6124 163.8936 215.5956 38.0253 495.2678 53.0221 26.8172 12.3802 2.3430 12.2942 11.1451 5.2609 6.3918
temp: 298.150 k
press: 1.00000 atm
elementType: 16 8 7 7 6 6 6 6 6 6 1 1 1 1 1 1 1 1
symmnumber: 1
zpe: 353673.4 jmol-1
zpe.correction: 0.134707 hartree
zpe.thermalcorrener: 0.145106 hartree
zpe.thermalcorrenthalpy: 0.146051 hartree
zpe.thermalcorrgfe: 0.098249 hartree
zpe.sumelectzpe: -815.463324 hartree
zpe.sumelectthermal: -815.452924 hartree
zpe.sumelectthermalent: -815.451980 hartree
zpe.sumelectthermalfe: -815.499782 hartree
dipole: -2.9290 6.2434 0.0070
dipole: 6.8963
quadrupole: -68.7592 -62.7134 -67.6702
quadrupole: 14.8140 0.0117 -0.0161
quadrupole: -2.3783 3.6675 -1.2893 14.8140 0.0117 -0.0161
hfenergy: -815.5980307 hartree
pointgroup: C01 [X(C6H8N2O1S1)]
dipole: 1.5122226 -2.1874568 0.5382836 debye
dipolederiv: -0.7355342 -0.2462422 0.0730922 -0.1676035 -0.1495253 0.0075245 0.0537327 0.008511 -0.1336666 -1.0033377 0.3428109 -0.077875 0.5621249 -0.8199926 0.1050131 -0.1342853 0.1086408 -0.4013152 -1.1048911 0.0878942 -0.0069039 -0.3266636 -0.8150849 0.1959614 0.1051153 0.1815365 -0.1263613 -1.7389767 0.2532341 -0.041096 0.4126524 -0.5226248 0.0703311 -0.0806165 0.0726121 -0.2409084 1.6661274 0.2913036 -0.0995715 -0.0341008 0.9201101 -0.2287579 -0.0168756 -0.2334286 0.0889436 0.9343301 -0.195478 0.0325225 -0.0040231 0.1638041 -0.0616673 -0.0185261 -0.0562164 -0.0586665 0.2646114 -0.2378608 0.0645802 -0.1607428 0.2841404 -0.0193506 0.0415632 -0.0171433 0.209471 -0.2327409 0.0377731 -0.0090334 0.336421 -0.5430081 0.0857031 -0.0848581 0.0910599 -0.2107707 1.6982508 -0.3703722 0.0713266 -0.6015943 1.104744 -0.2114263 0.1298842 -0.215204 0.2975236 -0.1698208 0.0726245 -0.0147519 0.1934821 0.2125071 -0.0317517 -0.0460875 -0.0298821 0.1073608 0.0907517 0.0037708 0.0004074 -0.0462298 -0.0628154 0.0588156 0.0129708 0.0577426 0.1481548 0.0338445 -0.1539991 0.0361516 -0.0337629 -0.0685261 0.0471288 0.0080176 0.0494198 0.1157106 0.0016747 0.0669624 -0.0905379 -0.0008984 0.0644373 -0.0738444 -0.0951034 -0.0319431 -0.0076786 0.0032011 0.0977268 0.04872 0.0377284 0.1004294 0.0219787 0.0826115 -0.0177863 -0.0343105 -0.0296907 -0.0629643 0.0197749 -0.0567974 0.0653589 0.0294546 0.017937 0.029264 0.1684839 0.1674437 0.1273167 -0.033583 0.0488487 0.0851526 0.009896 -0.0133837 0.0085507 0.12489 0.0793935 -0.036514 0.0924926 -0.0591375 0.0130896 0.0304684 0.0958509 0.0459764 -0.0480158 0.0753632 -0.0779866 -0.0657155 -0.0997034 -0.0321964 -0.0354772 -0.057947 -0.0517101 0.0011552 unknown
polarizability: 137.0574055|-2.2387763|112.0496599|-0.863917|-16.5229405|51.8170349 unknown
InChI: InChI=1S/C6H8N2OS/c1-8-4-3-5(9)7-6(8)10-2/h3-4H,1-2H3
charge 0 multiplicity 1
18 atoms
S  2.625162 0.245041 -0.436228
O  -2.335521 1.483572 -0.673381
N  0.501893 -1.432466 0.02646
N  -0.07415 0.827741 -0.543221
C  0.813222 -0.107717 -0.317698
C  -0.859033 -1.749663 0.132936
C  1.545906 -2.450336 0.271384
C  -1.838042 -0.812527 -0.090155
C  -1.487224 0.574282 -0.453298
C  2.54771 2.066681 -0.899827
H  -1.08268 -2.785268 0.403244
H  1.060405 -3.411792 0.499196
H  2.182549 -2.158256 1.12474
H  2.183574 -2.574741 -0.621052
H  -2.893621 -1.079343 -0.003173
H  1.473206 2.319601 -0.950139
H  3.033859 2.195379 -1.876976
H  3.056885 2.645011 -0.116412
