program: Gaussian 09
title: 000138719
version: EM64L-G09RevD.01
frameworkgroup: C1[X(C13H15N)]
method: RPBEPBE
basis: SDD
operation: Freq
keyword: #pfreq=noraman
keyword: PBEPBE/SDD
title: #p freq=noraman PBEPBE/SDD
converged: YES YES NO NO
title: Mulliken charges:
elementType: N C C C C C C C C C C C C C H H H H H H H H H H H H H H H
charge: -0.237241 0.202657 0.141212 -0.498266 -0.510433 -0.406763 -0.410844 0.153660 0.208020 -0.666862 -0.422291 -0.363721 -0.253874 -0.235738 0.215382 0.220304 0.215819 0.212102 0.210524 0.204855 0.206390 0.203672 0.243761 0.236162 0.237211 0.230221 0.231291 0.216064 0.216727
chargesum: 0.00000
title: Mulliken charges with hydrogens summed into heavy atoms:
elementType: N C C C C C C C C C C C C C
charge: -0.237241 0.202657 0.141212 -0.062581 -0.082512 0.008616 -0.000782 0.153660 0.208020 0.050271 -0.192070 -0.132430 -0.037810 -0.019011
polarizability: 1.98145437e+02 8.93525067e+00 1.55830490e+02 4.96072462e-02 1.05214530e+00 7.94058010e+01
1716.lowfreq: -16.6083 -10.6910 -6.2752 -0.0008 0.0004 0.0005 67.6373 78.7942 120.5100
frequency: 67.6134 78.7771 120.5096 135.5469 176.3688 196.2915 255.1541 275.2120 310.0002 321.0829 377.1898 432.8949 459.4634 517.8993 551.3868 561.1914 575.8244 623.0523 630.6172 678.9161 745.6441 756.0857 786.1413 826.4368 828.8510 847.7891 862.7099 909.7684 925.7130 962.3455 965.8881 978.0879 1011.9838 1043.2336 1077.2879 1085.5020 1110.6158 1116.3209 1129.3106 1133.3535 1154.7442 1164.9864 1199.6774 1237.2312 1248.2409 1252.4867 1303.5702 1315.8592 1334.4412 1338.0163 1345.8174 1379.0117 1410.0455 1418.1527 1443.0846 1457.0134 1465.3687 1466.1684 1471.1280 1473.0448 1474.9887 1480.6273 1497.2113 1579.5475 1589.1255 1625.3154 2944.7516 2949.8973 2969.8907 2977.3108 2979.7080 2998.6154 3006.1419 3040.6359 3041.4305 3049.4163 3106.6439 3118.7282 3127.6312 3141.0078 3158.5990
redmass: 1.1216 3.1225 2.1808 3.0918 2.6517 4.1172 2.7696 2.4100 3.1745 2.5011 4.4436 2.8752 2.6485 3.9515 4.4310 4.5868 3.8494 3.8486 3.2795 4.7400 1.2944 4.0377 3.5302 1.5261 2.6179 1.4898 2.4533 1.4932 1.3861 2.3396 1.2987 4.1751 2.1014 3.2941 1.8272 2.1088 1.5672 1.2966 1.4767 1.1547 1.3662 1.2659 2.4663 1.3008 1.6834 1.3336 1.5179 1.5068 1.6619 1.4438 1.8296 2.5230 4.3889 3.1479 1.5795 1.1466 1.1411 1.2052 1.0915 1.8594 1.2015 2.7825 1.1593 6.6156 7.1555 7.3807 1.0617 1.0642 1.0366 1.0646 1.0693 1.0889 1.0931 1.0990 1.1016 1.1042 1.0968 1.0844 1.0887 1.0951 1.1001
irintensity: 0.4786 0.6226 1.4107 2.4009 4.0873 0.2486 1.1394 0.5341 2.0876 0.3443 1.0345 4.4063 1.0039 2.0694 2.6916 3.9360 0.6051 0.8020 3.9405 1.3610 103.8838 0.5945 0.5731 3.8960 1.6233 0.1940 6.5245 0.7757 2.4569 2.3233 0.0060 2.0705 12.3119 1.3758 0.3371 2.4819 8.3610 0.8853 18.7191 1.0958 4.6823 0.1880 8.0417 6.1905 4.3921 6.5587 5.6910 7.6568 8.7911 4.6741 2.5409 28.8295 34.3519 18.5639 6.7574 6.2301 10.9746 12.7922 14.4969 3.2174 7.0735 57.5927 8.7604 0.1486 6.8187 4.9685 54.3406 45.6383 80.4707 29.4177 20.2665 60.2287 33.2498 82.1189 27.6522 67.4531 11.6159 1.3810 4.4274 41.9476 35.3918
temp: 298.150 k
press: 1.00000 atm
elementType: 7 6 6 6 6 6 6 6 6 6 6 6 6 6 1 1 1 1 1 1 1 1 1 1 1 1 1 1 1
symmnumber: 1
zpe: 647080.3 jmol-1
zpe.correction: 0.246460 hartree
zpe.thermalcorrener: 0.258374 hartree
zpe.thermalcorrenthalpy: 0.259318 hartree
zpe.thermalcorrgfe: 0.208652 hartree
zpe.sumelectzpe: -558.137205 hartree
zpe.sumelectthermal: -558.125291 hartree
zpe.sumelectthermalent: -558.124347 hartree
zpe.sumelectthermalfe: -558.175013 hartree
dipole: 1.9302 2.1414 0.0677
dipole: 2.8837
quadrupole: -78.9483 -72.0543 -87.6696
quadrupole: -0.9001 -0.1030 0.3934
quadrupole: 0.6091 7.5031 -8.1122 -0.9001 -0.1030 0.3934
hfenergy: -558.3836652 hartree
pointgroup: C01 [X(C13H15N1)]
dipole: 0.7807664 0.8223591 0.0365116 debye
polarizability: 198.5731034|7.8162018|155.3814801|0.9173963|1.5347846|79.4271446 unknown
InChI: InChI=1S/C13H15N/c1-14-12-8-4-2-6-10(12)11-7-3-5-9-13(11)14/h2,4,6,8H,3,5,7,9H2,1H3
charge 0 multiplicity 1
29 atoms
N  -0.011114 1.468719 0.023015
C  1.124636 0.626477 0.004386
C  0.717424 -0.70886 -0.029016
C  2.551606 1.106893 0.025555
C  1.692645 -1.863061 -0.038363
C  3.498562 -0.069987 -0.342614
C  3.10438 -1.378484 0.387051
C  -0.730809 -0.715067 -0.04029
C  -1.158871 0.662629 -0.005523
C  -0.024625 2.929255 0.077368
C  -1.715152 -1.737193 -0.070112
C  -2.522051 1.029324 -0.001827
C  -3.078539 -1.377002 -0.065983
C  -3.47816 -0.0088 -0.032645
H  2.709195 1.942392 -0.686775
H  2.817711 1.498338 1.030834
H  1.350598 -2.667939 0.642263
H  1.746921 -2.318477 -1.050004
H  3.454874 -0.24182 -1.436443
H  4.541059 0.20796 -0.096997
H  3.117036 -1.200383 1.481221
H  3.852704 -2.166344 0.176762
H  1.007692 3.30867 0.126611
H  -0.510976 3.359132 -0.819066
H  -0.566267 3.287434 0.973323
H  -1.421229 -2.792996 -0.097471
H  -2.83722 2.078557 0.023568
H  -3.847386 -2.157739 -0.088908
H  -4.545447 0.240471 -0.030623
