program: Gaussian 09
title: 000138706
version: EM64L-G09RevD.01
frameworkgroup: C1[X(C9H20O2)]
method: RPBEPBE
basis: SDD
operation: Freq
keyword: #pfreq=noraman
keyword: PBEPBE/SDD
title: #p freq=noraman PBEPBE/SDD
converged: YES YES NO NO
title: Mulliken charges:
elementType: O O C C C C C C C C C H H H H H H H H H H H H H H H H H H H H
charge: -0.459013 -0.461240 -0.428058 -0.421041 -0.400474 0.276255 0.302812 -0.730703 -0.731560 -0.715833 -0.747855 0.186977 0.220300 0.221468 0.218272 0.191292 0.214740 0.201048 0.213143 0.238393 0.201291 0.236516 0.214217 0.230811 0.227294 0.199045 0.210753 0.210926 0.234006 0.325322 0.320896
chargesum: 0.00000
title: Mulliken charges with hydrogens summed into heavy atoms:
elementType: O O C C C C C C C C C
charge: -0.133691 -0.140344 -0.020781 0.018700 0.005558 0.276255 0.302812 -0.078119 -0.079536 -0.058682 -0.092171
polarizability: 1.24954144e+02 1.71571958e+00 9.60975822e+01 2.79595059e+00 1.00283094e+00 9.57992328e+01
1716.lowfreq: -26.2154 -23.1752 -7.9106 -0.0007 0.0002 0.0006 8.8656 46.9772 76.2852
frequency: -22.8378 46.9247 76.1838 87.6651 116.8899 184.0641 214.1009 215.0990 219.2832 241.6177 255.4118 286.2695 293.4322 321.2419 325.6288 328.4120 360.9598 401.1028 434.0782 438.3696 440.6892 496.1022 534.8696 720.8365 741.5028 759.0388 823.2506 863.6197 879.4347 902.9958 921.6482 925.2509 973.3679 976.3503 987.3584 1028.5770 1040.7044 1065.9790 1082.2314 1095.9873 1113.2798 1170.4519 1196.2230 1228.1448 1248.7375 1251.5629 1299.9966 1304.6034 1312.9519 1325.4196 1348.5360 1366.2942 1375.2427 1375.8456 1390.2215 1394.3666 1442.6701 1455.8121 1456.1596 1457.9599 1464.2536 1466.2393 1471.3162 1475.8670 1482.3353 1484.1012 1485.7163 2960.5012 2971.1510 2971.4527 2976.1092 2976.3832 2983.1692 2990.5147 3010.3329 3032.8350 3051.6659 3060.2095 3066.0837 3066.6960 3084.5947 3085.2404 3089.7691 3092.5056 3096.5205 3540.1106 3546.6806
redmass: 3.1041 3.2718 1.6851 3.5068 2.2660 1.0962 2.6079 1.9704 1.2983 1.1556 1.2156 1.0612 1.0478 2.5491 2.4639 2.4763 2.3887 2.2989 2.7314 2.8172 3.1729 2.4816 3.0745 4.3764 1.1415 3.8944 1.5225 2.8637 2.4902 1.5817 1.4925 1.7514 1.3419 1.8685 1.3318 1.7596 2.0858 2.1802 1.4731 1.3993 1.6665 1.9858 2.3206 2.4276 1.3030 1.9290 1.5631 1.4126 1.1633 1.7178 1.8045 1.5879 1.3132 1.2367 1.2274 1.2179 1.0735 1.0509 1.0689 1.0622 1.0575 1.0515 1.0736 1.0767 1.0746 1.0711 1.0582 1.0592 1.0383 1.0546 1.0390 1.0379 1.0587 1.0360 1.0958 1.1023 1.1029 1.0987 1.0975 1.0978 1.0997 1.1001 1.0995 1.0997 1.0997 1.0657 1.0655
irintensity: 0.7910 0.5563 1.9681 1.0517 2.4438 4.4300 0.6218 2.0218 0.6467 9.4574 1.7802 121.7745 140.5253 5.3465 23.9795 2.7298 6.7502 2.4514 15.5689 9.2292 6.5091 0.6610 6.8087 4.4695 5.0833 4.0150 4.6560 35.7736 13.9636 0.6607 2.5112 11.3394 0.5669 2.9737 2.0124 21.7438 24.9511 6.6284 13.8124 20.8028 86.7447 6.8542 33.0164 46.1825 14.5738 13.4686 21.7272 26.1859 6.9553 31.8741 9.0615 4.7264 39.9897 29.8502 24.1719 17.1960 0.5424 1.3740 3.7336 1.3762 0.7869 5.0532 5.5264 4.8691 15.5984 10.1374 24.3117 6.3711 19.5886 14.1581 60.1558 13.0605 26.3182 25.9075 1.6018 4.0642 55.5917 25.5412 109.0413 19.2774 11.2150 23.1394 36.0652 46.0572 44.2625 4.4524 4.6369
temp: 298.150 k
press: 1.00000 atm
elementType: 8 8 6 6 6 6 6 6 6 6 6 1 1 1 1 1 1 1 1 1 1 1 1 1 1 1 1 1 1 1 1
symmnumber: 1
zpe: 721368.3 jmol-1
zpe.correction: 0.274755 hartree
zpe.thermalcorrener: 0.288943 hartree
zpe.thermalcorrenthalpy: 0.289887 hartree
zpe.thermalcorrgfe: 0.235029 hartree
zpe.sumelectzpe: -504.458682 hartree
zpe.sumelectthermal: -504.444494 hartree
zpe.sumelectthermalent: -504.443550 hartree
zpe.sumelectthermalfe: -504.498408 hartree
dipole: 1.5453 2.3537 0.0654
dipole: 2.8164
quadrupole: -71.5150 -72.7783 -72.6874
quadrupole: 2.1818 9.6897 0.3856
quadrupole: 0.8119 -0.4514 -0.3605 2.1818 9.6897 0.3856
hfenergy: -504.733437 hartree
pointgroup: C01 [X(C9H20O2)]
dipole: 0.6065359 0.9236324 -0.0824146 debye
polarizability: 124.9175427|2.0919453|96.3407259|2.7243261|0.9547345|95.5926902 unknown
InChI: InChI=1S/C9H20O2/c1-8(2,10)6-5-7-9(3,4)11/h10-11H,5-7H2,1-4H3
charge 0 multiplicity 1
31 atoms
O  3.623838 -0.918994 -0.58916
O  -2.720941 -0.013723 1.476405
C  -0.000881 0.125912 0.017478
C  1.276121 -0.617285 -0.435357
C  -1.276248 -0.598724 -0.473388
C  2.619144 0.012078 0.006139
C  -2.628052 0.019414 -0.012327
C  2.789683 0.017213 1.541967
C  2.833148 1.423029 -0.586475
C  -3.801492 -0.863817 -0.469954
C  -2.808185 1.475489 -0.500809
H  -0.015275 0.186632 1.125784
H  0.014313 1.164003 -0.367198
H  1.253913 -1.657876 -0.055761
H  1.29074 -0.688758 -1.5411
H  -1.2657 -0.636882 -1.581909
H  -1.247593 -1.647157 -0.115263
H  3.797583 0.380889 1.822095
H  2.053159 0.678037 2.033897
H  2.667386 -1.004935 1.941474
H  3.840897 1.804914 -0.331164
H  2.745446 1.390775 -1.686891
H  2.097194 2.1484 -0.195055
H  -3.694475 -1.881333 -0.055706
H  -4.756868 -0.445475 -0.108552
H  -3.836128 -0.930037 -1.572212
H  -2.781849 1.533381 -1.60481
H  -2.014534 2.139806 -0.109749
H  -3.78029 1.867514 -0.153749
H  4.530577 -0.596833 -0.346726
H  -2.012631 0.573042 1.847076
