program: Gaussian 09
title: 000138688
version: EM64L-G09RevD.01
frameworkgroup: C1[X(C12H17ClN2O2)]
method: RPBEPBE
basis: SDD
operation: Freq
keyword: #p
keyword: freq=noraman
keyword: PBEPBE/SDD
title: #p freq=noraman PBEPBE/SDD
converged: YES YES NO NO
title: Mulliken charges:
elementType: Cl O O N N C C C C C C C C C C C C H H H H H H H H H H H H H H H H H
charge: -0.039164 -0.226444 -0.225503 -0.164624 0.015505 -0.414363 -0.373199 0.583283 -0.338674 -0.371008 -0.299140 -0.302638 -0.677628 -0.680274 -0.386646 -0.416954 0.407153 0.217609 0.241416 0.223466 0.201294 0.215512 0.208810 0.232683 0.219907 0.252268 0.217978 0.209017 0.225496 0.209234 0.209858 0.229712 0.309083 0.286976
chargesum: 0.00000
title: Mulliken charges with hydrogens summed into heavy atoms:
elementType: Cl O O N N C C C C C C C C C C C C
charge: -0.039164 -0.226444 -0.225503 -0.164624 0.015505 0.044662 0.051560 0.583283 0.085648 0.081582 -0.299140 -0.050370 -0.025137 -0.031469 -0.077563 -0.129978 0.407153
polarizability: 2.79229323e+02 3.11365383e+00 1.59064619e+02 -9.74029960e+00 -2.50437482e+01 1.22139424e+02
1716.lowfreq: -11.6892 -4.7539 -0.0018 -0.0015 -0.0010 2.8021 30.2827 37.6976 49.5800
frequency: 30.2563 37.6518 49.5702 65.9648 67.8729 73.3012 81.8990 123.6682 162.2195 167.8973 191.1137 220.0843 221.5264 232.4555 253.8950 271.8898 311.3618 323.4626 340.7254 356.7865 428.2425 445.6115 488.3206 509.9598 538.3351 588.0919 616.1412 662.9686 682.3421 723.5272 729.2240 749.5659 749.8520 825.8968 831.7211 865.3226 869.4538 885.0388 901.8081 921.0783 971.3119 978.6188 1022.5099 1044.5418 1050.3632 1082.1690 1099.5259 1106.4926 1114.5798 1132.7663 1164.6849 1182.5364 1212.7430 1242.4955 1245.7458 1268.0857 1286.1777 1292.2205 1298.1964 1305.3030 1339.8190 1346.7068 1354.7712 1371.4089 1383.4268 1392.8899 1394.5496 1429.8400 1468.9288 1475.1372 1476.6876 1478.6758 1478.7760 1481.3519 1487.8863 1489.8901 1507.1178 1557.8791 1605.1508 2933.6651 2976.3342 2978.3352 2983.0872 2999.2430 2999.6215 3033.3218 3034.5684 3051.1372 3073.4418 3076.2778 3081.4670 3083.3345 3109.7709 3164.1201 3183.7547 3186.6546
redmass: 5.0934 3.8151 4.0076 7.2905 3.4633 2.0524 1.7662 3.6387 4.5450 6.0349 5.5486 1.2611 1.2066 2.9166 3.2743 3.0062 5.8102 4.0340 4.8152 5.2709 3.4285 3.4865 6.2894 5.5157 5.0008 4.0486 5.9361 6.3796 6.1009 4.1350 5.3366 1.1491 1.1346 1.4853 6.9125 1.4333 1.2686 1.7319 1.6408 1.4027 2.3599 1.6600 2.7857 3.1099 2.8876 2.2026 2.0907 3.0474 2.1511 1.5289 1.9621 2.0744 4.8416 1.4339 1.3289 1.4923 1.3131 1.1011 1.2502 1.3430 4.3699 1.6426 1.4447 5.4264 1.5691 1.2723 1.2107 5.2829 1.1063 1.0771 1.0690 1.0525 1.0420 1.2310 1.4832 1.1954 1.2717 8.2568 7.0071 1.0695 1.0364 1.0359 1.0598 1.0688 1.0607 1.0973 1.0947 1.0985 1.1004 1.1020 1.0993 1.0987 1.0961 1.0878 1.0928 1.0962
irintensity: 0.5876 0.2905 1.2851 0.1884 0.1148 0.4345 0.4447 1.5771 0.9638 1.0975 2.3693 0.0513 0.2063 1.4779 0.9463 0.1899 3.6862 1.9222 1.7852 5.9917 7.0946 17.2031 9.3039 0.9380 8.4938 10.5516 3.5714 18.6957 18.0464 7.7186 6.7751 8.5819 6.3734 31.8517 17.6273 5.4869 0.6335 15.1587 7.2562 25.8442 15.5624 22.0310 21.7534 3.8393 2.0604 49.1387 51.1398 16.5769 2.1434 30.2658 0.4952 43.9466 700.5747 62.6128 72.0662 39.6352 38.0468 1.5875 5.3173 1.2990 31.4200 66.0000 15.7195 81.6896 17.4632 7.9767 14.4335 28.3216 11.9146 4.2117 5.6846 26.4848 7.8398 19.7370 28.6325 28.4617 22.0381 0.0103 256.9013 53.0519 38.5419 38.0431 17.5317 54.1914 24.3651 2.8022 23.0821 3.6498 49.5659 73.3992 36.2553 35.7386 13.6648 5.5559 3.5711 7.4928
temp: 298.150 k
press: 1.00000 atm
elementType: 17 8 8 7 7 6 6 6 6 6 6 6 6 6 6 6 6 1 1 1 1 1 1 1 1 1 1 1 1 1 1 1 1 1
symmnumber: 1
zpe: 718753.5 jmol-1
zpe.correction: 0.273759 hartree
zpe.thermalcorrener: 0.291991 hartree
zpe.thermalcorrenthalpy: 0.292935 hartree
zpe.thermalcorrgfe: 0.225567 hartree
zpe.sumelectzpe: -1186.097739 hartree
zpe.sumelectthermal: -1186.079507 hartree
zpe.sumelectthermalent: -1186.078563 hartree
zpe.sumelectthermalfe: -1186.145930 hartree
dipole: -8.6158 1.1840 -0.7362
dipole: 8.7278
quadrupole: -133.8399 -105.0351 -110.0068
quadrupole: -2.1953 5.1679 1.6258
quadrupole: -17.5459 11.2588 6.2871 -2.1953 5.1679 1.6258
hfenergy: -1186.3714975 hartree
pointgroup: C01 [X(C12H17Cl1N2O2)]
dipole: -3.3616406 0.6037576 -0.3546854 debye
polarizability: 277.7437168|-11.683938|140.2348973|-15.5383849|-29.9621043|142.4547523 unknown
InChI: InChI=1S/C12H17ClN2O2/c1-3-7-14(8-4-2)12-6-5-10(15(16)17)9-11(12)13/h5-6,9H,3-4,7-8H2,1-2H3
charge 0 multiplicity 1
34 atoms
Cl -0.22876 -1.445851 2.611531
O  4.438475 0.211161 -1.405155
O  4.535947 -1.179114 0.409199
N  -1.778496 0.128044 0.275554
N  3.884788 -0.420006 -0.416302
C  -2.657313 -1.049028 0.523748
C  -2.462832 1.301348 -0.328655
C  -0.39118 -0.006995 0.143745
C  -3.137197 -1.728154 -0.785497
C  -2.036703 2.647643 0.298725
C  0.438654 -0.756019 1.050392
C  0.309545 0.654151 -0.924494
C  -4.051458 -2.935708 -0.487285
C  -2.781904 3.83487 -0.347814
C  1.816582 -0.904983 0.870764
C  1.689382 0.532233 -1.116929
C  2.440673 -0.266811 -0.225262
H  -3.530336 -0.712278 1.115823
H  -2.122931 -1.789924 1.135971
H  -3.544993 1.158293 -0.155506
H  -2.333031 1.337817 -1.432939
H  -2.252052 -2.057565 -1.363702
H  -3.680464 -0.997873 -1.416657
H  -0.945318 2.789127 0.189665
H  -2.241859 2.610026 1.385062
H  -0.26759 1.243917 -1.640877
H  -3.521869 -3.699947 0.111503
H  -4.951093 -2.628143 0.07855
H  -4.390756 -3.416546 -1.42196
H  -2.566346 3.904696 -1.430932
H  -3.877489 3.73775 -0.22808
H  -2.477797 4.789678 0.116027
H  2.424487 -1.472835 1.579297
H  2.195536 1.022525 -1.95231
