program: Gaussian 09
title: 000138684
version: EM64L-G09RevD.01
frameworkgroup: C1[X(C6H11Cl)]
method: RPBEPBE
basis: SDD
operation: Freq
keyword: #pfreq=noraman
keyword: PBEPBE/SDD
title: #p freq=noraman PBEPBE/SDD
converged: NO YES NO NO
title: Mulliken charges:
elementType: Cl C C C C C C H H H H H H H H H H H
charge: -0.119104 0.050316 -0.448772 -0.448612 -0.417494 -0.417319 -0.692478 0.199049 0.259899 0.259826 0.199129 0.207486 0.238045 0.237940 0.207490 0.240057 0.204454 0.240090
chargesum: 0.00000
title: Mulliken charges with hydrogens summed into heavy atoms:
elementType: Cl C C C C C C
charge: -0.119104 0.050316 0.010175 0.010343 0.028037 0.028110 -0.007877
polarizability: 7.30755161e+01 -2.00671831e+00 7.49067386e+01 -2.57540869e-03 6.37254114e-03 6.36623928e+01
1716.lowfreq: -17.9934 -0.0012 -0.0008 0.0028 8.9472 12.4801 56.6336 139.9726 224.1247
frequency: 56.3893 139.9288 224.1218 252.7156 280.0781 348.6510 349.8329 491.2546 560.4293 634.9377 751.0906 790.8902 837.9929 886.1465 911.4915 938.1571 1001.6166 1022.7724 1024.6438 1060.5603 1149.1785 1169.5971 1191.7809 1210.9064 1230.3852 1244.4126 1279.2638 1290.6220 1312.0665 1334.1793 1386.0000 1446.0288 1455.3991 1458.2889 1465.1544 1473.0611 1485.5693 2972.1137 2976.1209 2983.0604 3010.6235 3025.2617 3060.7420 3073.8174 3078.1788 3080.3250 3094.8693 3102.1394
redmass: 1.6894 3.4604 1.1151 2.0722 2.7741 3.0284 2.7005 3.1984 3.3162 2.7228 1.2725 1.6476 3.1532 2.4312 1.8382 1.5850 1.7402 1.4588 1.3445 3.2301 1.5869 1.7200 1.4995 1.5356 1.7316 1.4452 1.3355 1.1900 1.4467 1.8318 1.2218 1.0809 1.0818 1.0526 1.0807 1.0508 1.0944 1.0668 1.0547 1.0502 1.0596 1.0632 1.1014 1.0957 1.0971 1.0977 1.1030 1.1006
irintensity: 0.3713 1.1952 0.0104 0.8042 1.0370 7.8769 0.0590 25.2564 0.2337 1.3952 23.8460 0.1757 1.5680 2.5173 2.0127 1.6631 7.0603 0.0177 21.9646 0.2049 0.5984 10.7563 28.5571 6.2600 9.4886 2.9339 1.0249 2.5454 0.4123 13.1556 16.4527 4.6097 6.1959 12.7530 7.6851 10.9065 8.4276 8.6518 5.5081 68.2776 32.6086 51.6386 5.6459 14.8382 3.5297 16.6294 67.0083 20.0002
temp: 298.150 k
press: 1.00000 atm
elementType: 17 6 6 6 6 6 6 1 1 1 1 1 1 1 1 1 1 1
symmnumber: 1
zpe: 410336.1 jmol-1
zpe.correction: 0.156289 hartree
zpe.thermalcorrener: 0.164055 hartree
zpe.thermalcorrenthalpy: 0.164999 hartree
zpe.thermalcorrgfe: 0.123848 hartree
zpe.sumelectzpe: -694.733921 hartree
zpe.sumelectthermal: -694.726154 hartree
zpe.sumelectthermalent: -694.725210 hartree
zpe.sumelectthermalfe: -694.766362 hartree
dipole: -1.2422 2.3608 0.0021
dipole: 2.6677
quadrupole: -51.3770 -51.1094 -49.8609
quadrupole: 2.1788 0.0020 -0.0014
quadrupole: -0.5946 -0.3269 0.9215 2.1788 0.0020 -0.0014
hfenergy: -694.8902094 hartree
pointgroup: C01 [X(C6H11Cl1)]
dipole: -0.2884144 -0.0130563 1.009044 debye
dipolederiv: -0.3139628 -0.0013788 0.1046747 -0.0014063 -0.2625257 0.0063907 0.1048251 0.0063662 -0.7511339 0.3480081 0.0012882 -0.1031167 0.0024271 0.3127149 -0.0078539 -0.1819274 -0.0077666 0.9161355 -0.0481499 -0.0363702 -0.04018 -0.0407806 -0.0798959 0.0353846 0.0345021 -0.006323 0.0079395 -0.0480055 0.0375007 -0.0390975 0.0399644 -0.0792048 -0.0377381 0.0358187 0.0038436 0.0071586 0.0387407 0.0211306 -0.0655872 0.0143281 0.0144536 -0.0015755 -0.0340403 0.0242966 0.1273388 0.0388012 -0.0194438 -0.0659379 -0.0134468 0.0149871 -0.0016611 -0.0346709 -0.0273473 0.1267488 -0.134127 0.000154 -0.0113892 0.0005436 0.0245277 0.001272 -0.0461073 0.0012651 -0.0721819 0.0262026 -0.0176413 0.0145312 -0.012202 0.077984 0.0355662 -0.0265529 0.0599656 -0.1698528 0.0303435 0.0792771 0.0218092 0.0712212 -0.0829184 -0.0431238 0.017073 -0.0799499 0.0731087 0.0302408 -0.0797727 0.0197428 -0.0716948 -0.0859457 0.0389763 0.015222 0.0757516 0.0762105 0.0261506 0.0171932 0.0148012 0.012843 0.0802637 -0.0289986 -0.026443 -0.053406 -0.1721664 -0.0971074 -0.0890493 0.0789323 -0.070631 0.010209 0.0472406 0.1167674 0.0718971 0.0110115 0.0599551 0.0009276 -0.0165295 -0.0129204 0.0243595 -0.0544285 -0.0795688 -0.0914526 -0.1035692 0.0596117 -0.0001911 -0.016902 0.015454 0.0201163 0.058039 -0.0794647 0.0950258 -0.0993074 -0.0967665 0.0865986 0.0815001 0.0671347 0.0135754 -0.0472339 0.1188874 -0.071946 0.0072948 0.0094011 -0.0781414 -0.0071298 -0.1252095 -0.054013 0.0272413 0.0227493 0.0473412 0.0920071 0.0613829 -0.0004826 0.0349063 -0.000223 0.1030429 0.0035863 0.0167938 0.0036076 -0.1666796 0.0092807 0.0784012 -0.0050281 0.1245982 -0.0517305 -0.0310836 0.0261365 -0.051169 0.0899375 unknown
polarizability: 72.348599|0.0185347|63.6643223|-1.4720804|-0.1521194|75.6317263 unknown
InChI: InChI=1S/C6H11Cl/c1-6(7)4-2-3-5-6/h2-5H2,1H3
charge 0 multiplicity 1
18 atoms
Cl 1.053783 0.022137 -1.733466
C  0.661172 -0.002936 0.183548
C  -0.255255 -1.219233 0.421952
C  -0.254604 1.207114 0.454297
C  -1.658327 -0.784077 -0.087697
C  -1.6584 0.786248 -0.06547
C  2.015277 -0.012224 0.890482
H  -0.275991 -1.402661 1.516526
H  0.126299 -2.132959 -0.062263
H  0.127073 2.133122 -0.005958
H  -0.274349 1.36174 1.553345
H  -2.46167 -1.208295 0.540244
H  -1.814681 -1.148957 -1.117091
H  -1.816512 1.180195 -1.083868
H  -2.460871 1.192339 0.575428
H  2.603054 0.885544 0.634922
H  1.859243 -0.026915 1.987063
H  2.603659 -0.902384 0.610904
