program: Gaussian 09
title: 000138652
version: EM64L-G09RevD.01
frameworkgroup: C1[X(C6H16N3P)]
method: RPBEPBE
basis: SDD
operation: Freq
keyword: #p
keyword: freq=noraman
keyword: PBEPBE/SDD
title: #p freq=noraman PBEPBE/SDD
converged: YES YES NO NO
title: Mulliken charges:
elementType: P N N N C C C C C C H H H H H H H H H H H H H H H H
charge: 0.882716 -0.416500 -0.495542 -0.405601 -0.403910 -0.304224 -0.620605 -0.591158 -0.604251 -0.605641 0.216869 0.277881 0.223670 0.194639 0.232265 0.203700 0.232151 0.221158 0.204075 0.222620 0.252631 0.194292 0.221722 0.192079 0.252159 0.222803
chargesum: 0.00000
title: Mulliken charges with hydrogens summed into heavy atoms:
elementType: P N N N C C C C C C
charge: 0.882716 -0.416500 -0.495542 -0.405601 0.090841 0.114085 0.047512 0.056695 0.064394 0.061400
polarizability: 1.23809026e+02 -9.50690978e-02 1.09719133e+02 1.22609940e+00 2.27297926e-01 9.23473300e+01
1716.lowfreq: -22.6535 -15.5139 -0.0013 0.0009 0.0014 5.0211 54.0911 59.7209 68.7186
frequency: 53.5521 59.5277 68.4428 101.8290 141.2455 150.6241 177.3606 204.4409 228.5699 233.1145 266.4973 275.1331 310.7278 338.1286 381.4032 405.0283 479.6198 553.7452 559.0939 591.5992 624.7847 794.0280 876.3454 920.1603 960.0586 991.0276 1027.9093 1042.7330 1085.2869 1099.9020 1107.0743 1122.6822 1123.0984 1142.5127 1170.1991 1186.1317 1196.8311 1202.5696 1228.4803 1262.1217 1317.9090 1328.7136 1405.9371 1422.2238 1423.2106 1433.7228 1435.3087 1457.0153 1463.8891 1465.6195 1473.4840 1475.4866 1481.8695 1484.2768 1487.7424 1499.8617 2869.0642 2878.5076 2896.1198 2900.7124 2907.2391 2980.6591 2990.4746 2996.9241 3001.0318 3020.9926 3027.5124 3064.9136 3071.7457 3076.0004 3078.7787 3098.9074
redmass: 2.3287 2.6983 2.4785 2.3409 1.8201 2.3560 1.0804 1.5523 1.4794 1.1303 2.2692 2.4605 2.8363 2.7493 3.0306 3.0042 6.3887 4.6654 5.5165 3.2395 6.8845 1.8223 2.6284 3.2975 2.7843 2.7918 1.7902 1.3629 1.2173 1.3609 1.3193 1.4290 1.5531 1.5034 1.9694 3.2651 2.5781 3.6441 1.9323 1.5662 1.4249 1.1686 1.1281 1.1505 1.1256 1.1381 1.0990 1.0483 1.0530 1.0474 1.0507 1.0494 1.0714 1.0493 1.0492 1.0552 1.0531 1.0526 1.0579 1.0483 1.0580 1.0905 1.0928 1.0789 1.0808 1.0809 1.0610 1.0951 1.0961 1.0972 1.0993 1.1061
irintensity: 1.4140 3.1147 3.8970 2.8202 1.9504 0.8536 0.6286 3.9344 4.9050 1.4433 6.1056 0.8161 0.5436 1.0966 1.0222 9.2080 13.5446 31.6272 52.6431 7.2082 26.0944 13.0990 42.0735 132.3317 17.4304 46.6954 18.4923 5.1791 1.7187 1.4202 4.3908 1.1033 3.8622 13.4043 34.1847 35.4469 5.3522 44.7507 1.1078 6.7212 0.7342 0.2406 8.6758 1.9373 7.4451 4.5911 7.7240 9.9993 12.6163 3.6404 22.1326 16.9466 14.0817 10.6534 1.7242 8.0662 92.2629 282.5751 23.2428 64.2730 239.5233 74.2007 34.8868 71.4740 27.1707 44.5713 53.2020 24.0625 14.9796 17.4807 23.5470 18.1075
temp: 298.150 k
press: 1.00000 atm
elementType: 15 7 7 7 6 6 6 6 6 6 1 1 1 1 1 1 1 1 1 1 1 1 1 1 1 1
symmnumber: 1
zpe: 584133.4 jmol-1
zpe.correction: 0.222485 hartree
zpe.thermalcorrener: 0.235897 hartree
zpe.thermalcorrenthalpy: 0.236842 hartree
zpe.thermalcorrgfe: 0.182819 hartree
zpe.sumelectzpe: -742.837366 hartree
zpe.sumelectthermal: -742.823953 hartree
zpe.sumelectthermalent: -742.823009 hartree
zpe.sumelectthermalfe: -742.877032 hartree
dipole: 1.2358 0.6249 0.1555
dipole: 1.3935
quadrupole: -65.9821 -68.8646 -70.4800
quadrupole: -0.8994 0.5058 -0.0366
quadrupole: 2.4601 -0.4224 -2.0378 -0.8994 0.5058 -0.0366
hfenergy: -743.0598508 hartree
pointgroup: C01 [X(C6H16N3P1)]
dipole: -0.4707059 0.2805641 0.0171945 debye
dipolederiv: 1.2693765 -0.1893067 -0.0202676 -0.1480408 0.7950747 -0.0021183 0.0321365 0.0147974 0.5090198 -0.6453521 -0.0468675 0.0339513 -0.0913018 -0.720065 0.129496 -0.0110056 -0.1098193 -0.5204652 -0.7456494 0.2267869 -0.0457425 0.1183843 -0.8858288 -0.2212943 -0.1331692 0.0851943 -0.5417646 -0.8919598 0.0332999 0.0128527 0.0180459 -0.6863618 0.0322454 0.2619672 0.0056213 -0.5034341 0.1207834 -0.1282816 -0.0245056 -0.1056233 0.1888687 -0.0781058 0.0580964 -0.0086688 0.276512 0.5042603 0.0467304 0.0633154 0.1936184 -0.1003685 0.0121649 0.1151187 -0.1033496 0.3321754 0.3681551 0.1103004 -0.1406429 0.0960862 0.3294022 -0.0440128 -0.271411 -0.1458664 0.1937389 0.2786466 -0.1067112 -0.1375752 -0.2000228 0.6363355 0.1328057 -0.2368151 0.2303728 0.231006 0.3573462 -0.1577003 0.0944901 -0.4073107 0.2795435 0.0503638 0.2524235 -0.0043631 0.2111327 0.3532855 0.1912414 0.0526737 0.4687141 0.266275 -0.0666791 0.140612 -0.0350531 0.2257349 -0.0865554 -0.1069054 -0.1133489 -0.0771624 0.007467 -0.0474155 -0.0771921 -0.0465565 0.0480148 0.0425926 0.047538 0.1398034 0.0188336 0.0292381 0.0363922 0.0737842 0.0136724 -0.0366706 0.0063349 -0.0057205 -0.0100035 0.0341295 -0.0122205 0.1428153 -0.0868456 0.1205282 -0.1500505 -0.2636751 0.0487877 0.0067478 0.0186629 0.0479395 -0.0113382 0.1063781 -0.0274908 -0.0092602 -0.0173221 -0.1386959 0.0073713 -0.1215373 -0.0961628 -0.054738 -0.0537576 -0.1147929 0.0475533 -0.1903105 0.0155503 0.1270848 0.1642239 -0.0424997 -0.0574287 0.1082801 0.0243673 0.020869 0.055203 0.0599125 -0.0999162 0.0376877 0.0892592 0.044066 -0.0354189 0.1073309 -0.0873318 0.0079661 -0.048971 -0.1340224 0.0082284 0.0925864 0.0044922 -0.0902652 -0.0726371 -0.0456649 -0.238807 0.1369686 0.172317 -0.0136223 -0.0178151 -0.0252276 0.1097766 -0.0575245 0.0202954 0.0689452 0.0160993 0.0449206 0.0252238 -0.2401053 0.0508872 0.0231517 0.1488925 -0.0019954 0.0805708 -0.1370312 0.0008911 -0.0739626 -0.0459934 0.021861 -0.0257306 0.0555145 0.0941167 -0.1891944 0.1206349 -0.1337464 0.0310452 0.0075698 -0.0338496 -0.2629118 0.0592562 -0.08759 -0.0622439 0.0930856 0.1098128 0.0651175 0.0705337 -0.0110448 0.1447956 -0.0562496 -0.1201087 -0.1999454 -0.1510918 -0.1023312 -0.0971664 -0.0079216 0.0101255 -0.2459738 -0.077868 -0.073014 0.0771452 0.1335438 -0.0313049 0.0732162 -0.0672474 0.0117954 -0.0497954 -0.0208126 0.1018427 -0.0595964 -0.0631965 0.1271751 -0.0354673 0.0824967 -0.0262581 0.1537714 0.0155045 -0.1346615 unknown
polarizability: 123.3928578|-0.8836649|109.778679|-3.5518551|0.2728524|92.7039518 unknown
InChI: InChI=1S/C6H16N3P/c1-7(2)10-8(3)5-6-9(10)4/h5-6H2,1-4H3
charge 0 multiplicity 1
26 atoms
P  0.35418 -0.117561 1.035025
N  -0.708836 -1.358667 0.246529
N  -0.593975 1.234091 0.329163
N  1.669068 -0.212413 -0.252204
C  -1.215679 -0.716346 -1.006986
C  -1.555044 0.782475 -0.70612
C  -1.75369 -1.944725 1.121339
C  -0.915372 2.45546 1.071911
C  2.488067 -1.439589 -0.194312
C  2.445199 1.019094 -0.478556
H  -2.094713 -1.268571 -1.382669
H  -0.406583 -0.758936 -1.75317
H  -1.468243 1.382727 -1.633819
H  -2.597195 0.895694 -0.324712
H  -2.202506 -2.818958 0.614852
H  -2.576189 -1.241972 1.390909
H  -1.290549 -2.299618 2.058669
H  -0.226591 2.57146 1.927663
H  -1.956379 2.44577 1.470419
H  -0.810773 3.357314 0.434446
H  1.82508 -2.311175 -0.055728
H  3.256277 -1.434618 0.617291
H  3.019979 -1.566961 -1.15739
H  3.23078 1.211367 0.293366
H  1.754078 1.879769 -0.507928
H  2.95201 0.954088 -1.461488
