program: Gaussian 09
title: 000138622
version: EM64L-G09RevD.01
frameworkgroup: C1[X(C11H15NO)]
method: RPBEPBE
basis: SDD
operation: Freq
keyword: #p
keyword: freq=noraman
keyword: PBEPBE/SDD
title: #p freq=noraman PBEPBE/SDD
converged: YES YES NO NO
title: Mulliken charges:
elementType: O N C C C C C C C C C C C H H H H H H H H H H H H H H H
charge: -0.292884 -0.440685 0.317442 -0.754358 -0.694714 -0.690040 0.185020 0.256335 -0.352020 -0.363127 -0.222955 -0.238480 -0.228346 0.219587 0.229618 0.215276 0.272008 0.207281 0.204448 0.204525 0.203995 0.271305 0.309059 0.274031 0.217164 0.231262 0.227883 0.231370
chargesum: 0.00000
title: Mulliken charges with hydrogens summed into heavy atoms:
elementType: O N C C C C C C C C C C C
charge: -0.292884 -0.131626 0.317442 -0.089877 -0.010977 -0.010216 0.185020 0.256335 -0.077988 -0.145963 0.008306 -0.010597 0.003024
polarizability: 1.76439947e+02 -1.25202531e+00 1.27518874e+02 3.28161364e+00 2.88955459e+00 7.80964951e+01
1716.lowfreq: -9.3480 -2.6994 -0.0004 0.0004 0.0005 5.2356 35.6668 55.0007 97.5487
frequency: 35.6085 54.9867 97.5338 116.5140 177.3769 190.7219 214.7900 247.6172 259.4444 274.0921 316.4508 336.7031 385.8297 403.1216 418.3246 445.1496 467.4279 504.6786 514.9248 614.8669 657.9251 690.1353 704.1689 755.5776 793.1692 847.9712 855.4723 909.7982 916.2389 924.9325 935.8005 953.2204 982.9499 989.3158 1004.4044 1025.9945 1035.0666 1038.3977 1081.6317 1122.2598 1172.5398 1188.5756 1216.9142 1231.9309 1235.6834 1289.2499 1314.3404 1371.6953 1375.5386 1383.7187 1399.6552 1431.2130 1449.4021 1456.0220 1465.9578 1473.0393 1476.6929 1485.0909 1495.3864 1502.2564 1571.7322 1603.8741 1610.4301 2971.9503 2982.5260 2987.2139 3063.3529 3076.1572 3080.6023 3091.7292 3105.0371 3109.2902 3114.1253 3130.2018 3143.1623 3156.8158 3168.5594 3540.6460
redmass: 3.4245 3.9235 3.6545 3.9537 3.8848 1.0437 3.4650 1.0954 1.0575 3.6107 3.3289 2.4457 3.4619 2.8217 2.9636 3.0152 3.0398 3.6524 1.2012 6.3422 6.0177 4.8116 1.5096 3.9747 2.4409 4.4122 1.3373 2.2463 1.7341 1.6579 1.5235 1.2072 1.4059 5.6142 1.3436 2.2790 1.3884 1.4571 1.5633 2.8165 1.0585 1.1235 2.2150 2.7935 2.9535 3.3590 1.3344 1.2062 1.2127 9.1426 1.2238 2.1812 1.0467 1.4803 1.0531 1.0494 1.5551 1.0621 1.6989 1.0702 6.1389 6.5613 6.1447 1.0366 1.0355 1.0363 1.1000 1.1001 1.0995 1.0979 1.1000 1.0996 1.0875 1.0868 1.0920 1.0956 1.1005 1.0770
irintensity: 0.7201 2.2631 1.1421 5.4407 1.3951 0.2222 5.9416 0.1191 0.0954 1.1219 7.9282 0.9028 2.5896 0.1136 1.7107 2.2098 1.5037 1.7276 75.9599 0.5549 10.9800 4.2684 102.7738 0.2024 18.5350 7.6611 4.0540 1.6448 0.6200 5.0929 2.1806 0.6475 1.4712 0.4259 1.6489 7.6838 0.0412 0.0346 15.3747 0.3570 0.8225 5.7638 30.2267 70.6433 40.9538 116.9206 2.5970 34.1893 40.3569 1.1954 48.2544 7.4870 0.7005 189.7185 3.7840 1.0132 22.0000 9.5594 147.0603 14.1382 75.2067 49.8626 3.1772 24.5301 36.4226 30.0878 26.3646 32.2766 25.8528 63.9152 3.1698 16.1159 11.1399 1.5912 23.8751 17.3749 21.4096 10.9359
temp: 298.150 k
press: 1.00000 atm
elementType: 8 7 6 6 6 6 6 6 6 6 6 6 6 1 1 1 1 1 1 1 1 1 1 1 1 1 1 1
symmnumber: 1
zpe: 617410.1 jmol-1
zpe.correction: 0.235159 hartree
zpe.thermalcorrener: 0.248413 hartree
zpe.thermalcorrenthalpy: 0.249357 hartree
zpe.thermalcorrgfe: 0.195468 hartree
zpe.sumelectzpe: -557.189767 hartree
zpe.sumelectthermal: -557.176514 hartree
zpe.sumelectthermalent: -557.175570 hartree
zpe.sumelectthermalfe: -557.229458 hartree
dipole: -0.0849 3.6113 -1.0410
dipole: 3.7593
quadrupole: -65.2988 -77.9102 -82.1921
quadrupole: 2.5895 0.0660 2.2629
quadrupole: 9.8349 -2.7765 -7.0584 2.5895 0.0660 2.2629
hfenergy: -557.4249265 hartree
pointgroup: C01 [X(C11H15N1O1)]
dipole: 0.0282344 -1.4018658 -0.470626 debye
polarizability: 176.4510599|-1.3461985|127.6883453|-2.9738831|-0.7284295|77.9159114 unknown
InChI: InChI=1S/C11H15NO/c1-11(2,3)12-10(13)9-7-5-4-6-8-9/h4-8,12H,1-3H3
charge 0 multiplicity 1
28 atoms
O  -0.651689 1.757387 0.483666
N  -1.272375 -0.404965 -0.15279
C  -2.758859 -0.225567 -0.100655
C  -3.376994 -1.589972 -0.490465
C  -3.189747 0.162314 1.33751
C  -3.194537 0.868586 -1.111478
C  -0.336366 0.567163 0.152763
C  1.113059 0.141838 0.057181
C  2.081924 1.163156 -0.113599
C  1.542577 -1.207437 0.163684
C  3.452141 0.842115 -0.204703
C  2.915609 -1.528715 0.077654
C  3.873243 -0.506053 -0.114037
H  -3.077366 -2.382583 0.221074
H  -4.478178 -1.520848 -0.475607
H  -3.073263 -1.892615 -1.511203
H  -2.719919 1.114117 1.63254
H  -2.891361 -0.620032 2.05871
H  -4.288087 0.278345 1.380591
H  -2.910078 0.585895 -2.141554
H  -4.291517 1.000826 -1.075485
H  -2.713065 1.827814 -0.861318
H  -0.933685 -1.29352 -0.526109
H  1.732176 2.199598 -0.162061
H  0.822241 -2.012468 0.355465
H  4.191412 1.63883 -0.342602
H  3.23863 -2.571484 0.17136
H  4.937875 -0.756426 -0.181033
