program: Gaussian 09
title: 000138619
version: EM64L-G09RevD.01
frameworkgroup: C1[X(C6H8O2)]
method: RPBEPBE
basis: SDD
operation: Freq
keyword: #p
keyword: freq=noraman
keyword: PBEPBE/SDD
title: #p freq=noraman PBEPBE/SDD
converged: NO YES NO NO
title: Mulliken charges:
elementType: O O C C C C C C H H H H H H H H
charge: -0.386148 -0.217480 -0.472690 -0.501923 0.140385 0.090778 0.029924 -0.738375 0.249204 0.249226 0.250003 0.249964 0.257530 0.257421 0.181887 0.360294
chargesum: 0.00000
title: Mulliken charges with hydrogens summed into heavy atoms:
elementType: O O C C C C C C
charge: -0.025854 -0.217480 0.025740 -0.001956 0.140385 0.090778 0.029924 -0.041537
polarizability: 8.95459093e+01 4.66378081e+00 7.73824732e+01 -4.22184363e-03 -8.16038215e-04 4.27970835e+01
1716.lowfreq: -66.0404 -17.7999 -6.9546 -0.0009 -0.0007 -0.0003 5.7420 105.5268 141.4078
frequency: -65.8996 105.5201 141.4065 231.7842 258.5890 318.2272 468.8987 508.5475 539.9320 540.6139 593.3954 642.2268 674.3103 829.7698 877.9531 990.2662 997.1074 1040.7526 1048.6191 1070.6419 1133.8079 1143.1517 1189.7312 1246.1358 1274.9432 1303.3712 1384.3118 1412.8458 1438.0731 1447.7549 1461.9077 1471.2869 1614.3050 1669.7746 2968.5432 3004.3154 3024.0552 3052.5623 3056.7489 3068.5881 3082.3780 3534.3313
redmass: 1.0298 2.4615 2.7412 2.9750 3.2067 5.6914 1.3035 3.9432 2.4860 7.0651 2.1763 5.3404 5.0878 1.4678 2.0417 2.4424 1.8797 1.5550 3.5427 1.9889 1.2120 2.7172 1.1201 1.5754 1.5541 3.8275 2.0375 1.5963 1.0855 1.0417 1.1074 1.0767 9.7679 8.3796 1.0384 1.0593 1.0620 1.1025 1.0964 1.0980 1.1020 1.0652
irintensity: 0.6397 4.7303 0.8898 0.6669 1.4815 19.0004 98.8180 9.1375 37.7188 2.0546 9.3151 17.6111 3.6204 10.4570 3.0361 37.7502 1.3450 1.3275 40.6570 4.5048 0.2112 188.4068 0.0404 4.1798 72.6875 61.1817 59.0561 27.9927 8.3624 13.6163 25.1699 0.8486 403.9873 52.3954 34.8861 24.6434 10.9936 5.4270 19.2278 12.5857 15.5405 25.8626
temp: 298.150 k
press: 1.00000 atm
elementType: 8 8 6 6 6 6 6 6 1 1 1 1 1 1 1 1
symmnumber: 1
zpe: 334125.9 jmol-1
zpe.correction: 0.127262 hartree
zpe.thermalcorrener: 0.134581 hartree
zpe.thermalcorrenthalpy: 0.135525 hartree
zpe.thermalcorrgfe: 0.095586 hartree
zpe.sumelectzpe: -383.269935 hartree
zpe.sumelectthermal: -383.262616 hartree
zpe.sumelectthermalent: -383.261672 hartree
zpe.sumelectthermalfe: -383.301611 hartree
dipole: -3.5615 0.0778 0.0013
dipole: 3.5623
quadrupole: -58.5572 -39.7447 -46.7824
quadrupole: -6.4643 0.0029 0.0009
quadrupole: -10.1958 8.6167 1.5790 -6.4643 0.0029 0.0009
hfenergy: -383.3971973 hartree
pointgroup: C01 [X(C6H8O2)]
dipole: -1.4012078 0.0300799 0.0005119 debye
dipolederiv: -1.4399423 0.1290181 0.0000575 0.3412763 -0.1952591 0.0000528 -0.0000357 -0.0000158 -0.3932139 -1.2027994 -0.1699471 0.0000968 -0.2255786 -0.5643483 0.0000417 0.0004148 0.0001342 -0.3411776 -0.0772579 -0.0197254 -0.0000737 0.0697565 -0.1529835 -0.0000852 -0.0002051 -0.0003283 0.1752648 0.0082565 -0.0259208 0.0000326 -0.0992741 -0.4153756 0.0002088 0.0000953 0.0002236 0.1082626 -1.0747033 0.053464 -0.0000101 0.0606357 -0.0385565 -0.000009 -0.0000485 0.0000444 -0.1368948 1.5794977 -0.0264844 -0.0000134 0.1191162 0.4096743 0.0001061 0.0001119 0.0002446 0.0432231 1.5860008 0.1092646 -0.000204 -0.1495112 0.7805848 -0.0001691 -0.0003574 -0.000179 0.1038594 0.0745876 -0.040704 0.0001942 -0.0324365 -0.0860124 0.0000253 0.0001836 -0.0000021 0.0908593 0.0486094 -0.019971 0.0593882 -0.0564258 0.0186979 0.0632933 0.0894809 0.1019102 -0.0229523 0.048704 -0.0198278 -0.0593116 -0.056358 0.0188019 -0.0632422 -0.0894282 -0.1018209 -0.0231635 0.0425408 0.0108868 0.0562381 0.0365497 0.0484013 -0.062193 0.077484 -0.093995 -0.0150554 0.0426547 0.0107942 -0.0561999 0.036471 0.0485565 0.0621416 -0.0774712 0.0939072 -0.0153573 0.0702595 -0.047188 0.0911386 -0.0191269 0.0291126 0.0337479 0.0636958 0.0890865 -0.0253528 0.0706397 -0.0468595 -0.0908471 -0.0191731 0.0287642 -0.0339284 -0.0635191 -0.0893472 -0.025958 -0.1641025 0.1359832 -0.0004589 0.0328202 0.0176256 0.0000438 -0.0003133 0.0001626 0.1065091 0.3870547 -0.0327828 -0.0000272 -0.0387413 0.0523161 -0.0000342 -0.0000879 -0.0000251 0.3711474 unknown
polarizability: 89.5423321|4.6684418|77.3860504|-0.0042215|-0.0008177|42.7970835 unknown
InChI: InChI=1S/C6H8O2/c1-4-5(7)2-3-6(4)8/h7H,2-3H2,1H3
charge 0 multiplicity 1
16 atoms
O  -2.453188 0.138816 -0.000105
O  2.389062 0.373558 -0.000783
C  -0.720741 -1.617754 -0.000357
C  0.831707 -1.584076 0.000189
C  -0.032072 0.716183 -0.000111
C  -1.098065 -0.153811 -0.000089
C  1.210257 -0.084339 -0.000009
C  -0.026843 2.220968 -0.000326
H  -1.140047 -2.126319 0.887124
H  -1.139272 -2.125675 -0.888596
H  1.268882 -2.075301 -0.886993
H  1.268013 -2.074565 0.888227
H  0.511229 2.606418 -0.885451
H  0.508399 2.606844 0.886337
H  -1.042882 2.662595 -0.002052
H  -2.606538 1.119258 -0.000003
