program: Gaussian 09
title: 000138610
version: EM64L-G09RevD.01
frameworkgroup: C1[X(C7H10O2)]
method: RPBEPBE
basis: SDD
operation: Freq
keyword: #pfreq=noraman
keyword: PBEPBE/SDD
title: #p freq=noraman PBEPBE/SDD
converged: NO NO NO NO
title: Mulliken charges:
elementType: O O C C C C C C C H H H H H H H H H H
charge: -0.382099 -0.219572 -0.473668 -0.501691 0.185754 0.066941 -0.003651 -0.482211 -0.663020 0.249232 0.248062 0.248317 0.251179 0.180227 0.257882 0.220730 0.204512 0.247358 0.365720
chargesum: 0.00000
title: Mulliken charges with hydrogens summed into heavy atoms:
elementType: O O C C C C C C C
charge: -0.016379 -0.219572 0.023625 -0.002195 0.185754 0.066941 -0.003651 -0.044102 0.009579
polarizability: 9.08421351e+01 4.38695967e+00 9.60899177e+01 4.17845508e+00 5.76352345e-01 5.46008403e+01
1716.lowfreq: -2.9058 -0.0011 -0.0010 -0.0003 10.6166 17.4066 47.0290 105.3386 130.7598
frequency: 46.6699 105.3139 130.7499 162.8492 185.2107 267.7150 309.2885 391.1700 486.8962 510.5788 540.3491 545.6818 624.9226 645.9140 676.3346 762.8956 831.6615 927.9398 941.1947 1001.3662 1002.2033 1054.1026 1075.5886 1094.4615 1133.1967 1148.8114 1190.9881 1241.6756 1260.2719 1273.3821 1303.4747 1329.1118 1386.8203 1399.8098 1439.5857 1461.1822 1466.3631 1475.5124 1486.9711 1608.0026 1660.7448 2957.6254 2983.0364 3004.0947 3022.4492 3034.7745 3052.1827 3079.1221 3079.6641 3093.0924 3529.0340
redmass: 2.6167 3.0702 2.0998 4.1669 1.4077 1.5670 5.3135 3.2955 1.4395 3.8074 5.1411 2.1558 3.4064 4.3111 3.4176 1.2996 1.5333 2.1881 2.3722 2.1587 2.1757 3.2753 1.9603 1.7842 1.2137 2.4689 1.1214 1.4573 1.5265 1.4157 1.7605 2.0608 1.4382 2.1200 1.0866 1.1013 1.0862 1.0689 1.0657 10.6266 8.8814 1.0658 1.0357 1.0592 1.0624 1.0945 1.1024 1.1006 1.1016 1.1006 1.0653
irintensity: 0.5002 5.1326 0.0417 0.3531 0.5284 0.1996 16.3986 5.6551 80.1785 8.2985 6.4411 44.5443 11.7511 8.6051 4.5242 5.8044 9.5357 9.3543 16.9382 11.6134 7.2935 32.2142 28.4663 17.4124 1.1750 137.8966 0.0816 2.4177 72.0753 36.1030 8.1991 27.1677 20.4942 67.1281 7.7683 30.1893 11.0551 8.8455 16.8535 380.1204 49.2530 48.3107 33.1171 25.2142 11.2195 2.3103 4.5389 36.1437 25.9706 26.4479 26.7325
temp: 298.150 k
press: 1.00000 atm
elementType: 8 8 6 6 6 6 6 6 6 1 1 1 1 1 1 1 1 1 1
symmnumber: 1
zpe: 409254.7 jmol-1
zpe.correction: 0.155877 hartree
zpe.thermalcorrener: 0.165172 hartree
zpe.thermalcorrenthalpy: 0.166116 hartree
zpe.thermalcorrgfe: 0.121194 hartree
zpe.sumelectzpe: -422.492311 hartree
zpe.sumelectthermal: -422.483016 hartree
zpe.sumelectthermalent: -422.482072 hartree
zpe.sumelectthermalfe: -422.526995 hartree
dipole: 0.0431 3.5169 0.1093
dipole: 3.5188
quadrupole: -47.0113 -64.2883 -53.1235
quadrupole: -5.4840 1.3887 -2.2136
quadrupole: 7.7964 -9.4806 1.6842 -5.4840 1.3887 -2.2136
hfenergy: -422.6481883 hartree
pointgroup: C01 [X(C7H10O2)]
dipole: -0.0787237 -1.3821027 -0.0143615 debye
dipolederiv: -0.2169949 -0.3630263 -0.0284278 -0.1234316 -1.4043633 0.0734484 -0.0453088 0.0925873 -0.3769454 -0.5580431 0.1783705 0.0371836 0.1300644 -1.2004507 -0.0410473 0.0423333 -0.0446811 -0.3455879 -0.1460017 -0.0635887 0.0668978 0.0277899 -0.0731366 0.0030226 0.0725285 0.0261741 0.1579168 -0.3975935 0.1026294 0.1048729 0.0365993 0.0126861 -0.007602 0.1071973 -0.0256451 0.088765 -0.1007273 -0.0639896 0.0109502 -0.0532116 -1.0487376 0.0308557 -0.0256244 0.02284 -0.1813034 0.4087172 -0.0944665 -0.0956669 0.0040343 1.5536067 -0.0624857 -0.073028 -0.0056167 0.0626369 0.7781405 0.1884961 -0.13633 -0.0466259 1.5368893 0.0320189 -0.1297967 -0.04923 0.1312118 0.0486728 0.021152 -0.0201542 -0.0075743 0.106428 -0.0449847 -0.070287 -0.0280272 0.1423895 0.0072664 0.0012897 -0.0258824 -0.0155024 0.0691531 0.0364013 0.0297435 0.0114551 0.001916 -0.0178584 0.075574 -0.0667313 0.0314019 0.0484816 0.0529108 -0.1036273 0.0766659 0.0123728 0.0486991 0.0334428 0.038214 0.0046899 0.0436986 -0.0656455 0.0865011 -0.1031935 -0.0512334 0.0770657 -0.0167315 0.0390896 0.0018512 0.0429966 0.0555657 0.0786514 0.0803009 -0.0457781 0.0103384 -0.0509117 -0.0686126 -0.0226179 0.0430502 -0.0510854 -0.1027312 -0.0653444 0.022079 -0.0143495 -0.0122878 0.007353 -0.0694842 -0.1085755 0.1695705 0.0197428 0.0945581 -0.0165734 0.0543801 -0.0004137 -0.0046156 0.0722398 0.0025082 -0.1186005 0.0082903 -0.0582575 0.0044189 -0.2328484 0.0173471 0.0236296 0.0065718 0.1070578 -0.004519 0.0350397 0.0025323 0.0617736 0.0769685 0.0631679 0.0210409 0.0148421 -0.0710091 -0.1390254 -0.0119024 -0.0858402 -0.0255248 0.1025067 -0.0708938 0.0279431 -0.0223491 -0.0441306 0.1051319 0.0123565 0.0651744 0.0183976 0.0716616 0.05484 0.0692458 0.0307124 0.3838471 -0.0239302 0.0699213 -0.0064523 0.3390684 unknown
polarizability: 90.2992642|-4.0685895|96.6878855|-3.8755254|-0.0390013|54.5457433 unknown
InChI: InChI=1S/C7H10O2/c1-2-5-6(8)3-4-7(5)9/h8H,2-4H2,1H3
charge 0 multiplicity 1
19 atoms
O  0.138269 -2.462549 0.168899
O  0.035482 2.381587 0.150598
C  1.900356 -0.781959 -0.241795
C  1.905378 0.769814 -0.256606
C  -0.360989 -0.028407 0.250153
C  0.461393 -1.118165 0.079274
C  0.448726 1.188517 0.055943
C  -1.840486 0.001093 0.550624
C  -2.707224 0.095102 -0.73488
H  2.576389 -1.207828 0.522206
H  2.193378 -1.224092 -1.21185
H  2.206821 1.189297 -1.23292
H  2.583869 1.203462 0.499613
H  -2.145858 -0.883363 1.149008
H  -2.040418 0.891689 1.17542
H  -3.78177 0.13449 -0.480041
H  -2.539906 -0.769261 -1.403601
H  -2.453423 1.012439 -1.293812
H  -0.819286 -2.583365 0.402065
