program: Gaussian 09
title: 000138572
version: EM64L-G09RevD.01
frameworkgroup: C1[X(C10H18O2)]
method: RPBEPBE
basis: SDD
operation: Freq
keyword: #pfreq=noraman
keyword: PBEPBE/SDD
title: #p freq=noraman PBEPBE/SDD
converged: YES YES NO NO
title: Mulliken charges:
elementType: O O C C C C C C C C C C H H H H H H H H H H H H H H H H H H
charge: -0.209653 -0.196403 0.409863 0.363806 -0.509711 -0.513584 -0.480021 -0.482477 -0.148288 -0.788515 -0.732124 -0.736329 0.227595 0.212880 0.202865 0.260940 0.197861 0.250119 0.223303 0.203585 0.222103 0.213270 0.233146 0.236575 0.210007 0.221159 0.234659 0.209703 0.208979 0.254689
chargesum: 0.00000
title: Mulliken charges with hydrogens summed into heavy atoms:
elementType: O O C C C C C C C C C C
charge: -0.209653 -0.196403 0.409863 0.363806 -0.069237 -0.049780 -0.032040 -0.055590 0.073814 -0.105524 -0.066298 -0.062957
polarizability: 1.38972279e+02 6.32933360e-01 1.00637062e+02 -1.61145057e+00 -4.12146390e-01 9.57782694e+01
1716.lowfreq: -19.9170 -6.6497 -0.0004 -0.0003 0.0005 16.7211 80.0070 146.1500 148.2121
frequency: 79.9112 146.1149 148.2014 160.3678 179.6036 222.2789 233.1368 252.4256 261.6340 297.6716 311.2992 354.4526 378.0943 414.5077 428.6096 441.7904 486.4403 519.2069 543.5805 608.2729 700.1098 763.2375 785.5362 797.1737 804.2438 855.7876 886.3446 900.4565 913.4623 924.3244 932.7250 961.6034 1002.7009 1011.6486 1029.2591 1054.8784 1077.9359 1106.9983 1118.4262 1140.0722 1165.2064 1182.7217 1201.3301 1208.8564 1251.0767 1259.7047 1268.9734 1292.4522 1305.1493 1313.2102 1328.8703 1340.6703 1350.8670 1378.2043 1381.7076 1394.8458 1446.4743 1450.1986 1456.0309 1459.7176 1469.4192 1473.4748 1474.2872 1477.3038 1485.0799 1492.7843 2969.0384 2977.2737 2980.7310 2984.1680 2987.0341 2987.9726 3006.7895 3013.0787 3047.1933 3050.6493 3064.6751 3071.7104 3073.7332 3080.7062 3081.5076 3084.3008 3094.4730 3095.9851
redmass: 2.6079 2.2371 3.0105 2.5234 1.0593 1.1355 1.7816 1.3253 2.3138 2.6620 2.5140 2.7109 2.2844 2.9098 3.0253 3.2143 4.8444 3.2531 3.8425 2.9902 5.8125 1.4600 2.6593 5.4027 5.3514 1.7376 2.3981 1.9856 1.7365 1.3350 1.8084 1.4493 3.4332 1.7645 1.5730 1.7703 1.8528 2.1632 1.6751 2.0927 1.9676 2.0263 2.0989 1.4904 1.4582 1.7439 1.6040 1.2291 1.4529 1.5784 1.9001 1.5316 1.6429 1.2024 1.2229 1.2061 1.0780 1.0783 1.0812 1.0682 1.0748 1.0496 1.0518 1.0702 1.0471 1.0542 1.0828 1.0362 1.0368 1.0477 1.0516 1.0569 1.0614 1.0619 1.1020 1.1005 1.0995 1.0997 1.1017 1.0997 1.0999 1.1002 1.1001 1.0993
irintensity: 0.6475 0.3441 1.1649 0.9175 0.0562 0.3525 0.1952 0.1130 0.5943 0.1784 1.3402 1.1543 1.4874 2.5847 1.0437 3.2684 2.8588 1.9850 0.7994 1.5456 3.6136 2.5992 1.5652 0.7218 1.8322 7.8402 2.6984 3.2060 2.3267 8.8364 4.8018 0.6562 7.6999 10.1204 9.2178 8.8834 6.4847 14.4640 2.6343 8.4530 1.2497 1.6483 6.3327 22.9635 4.2138 11.8317 6.9660 3.1360 1.5231 0.5096 6.3697 1.3910 8.1822 22.5326 18.5147 18.1167 0.7709 6.0874 1.4443 17.3257 9.8510 4.1621 8.2267 1.0008 11.5775 17.2595 11.3401 21.1396 32.2407 6.1356 23.4879 70.8492 50.6189 27.3781 7.2165 14.8138 5.4309 36.6711 67.9485 22.5985 5.7614 59.4388 28.1237 20.5503
temp: 298.150 k
press: 1.00000 atm
elementType: 8 8 6 6 6 6 6 6 6 6 6 6 1 1 1 1 1 1 1 1 1 1 1 1 1 1 1 1 1 1
symmnumber: 1
zpe: 689014.1 jmol-1
zpe.correction: 0.262432 hartree
zpe.thermalcorrener: 0.274992 hartree
zpe.thermalcorrenthalpy: 0.275936 hartree
zpe.thermalcorrgfe: 0.225456 hartree
zpe.sumelectzpe: -541.262615 hartree
zpe.sumelectthermal: -541.250055 hartree
zpe.sumelectthermalent: -541.249110 hartree
zpe.sumelectthermalfe: -541.299590 hartree
dipole: 0.1614 2.6130 2.2274
dipole: 3.4373
quadrupole: -68.8900 -76.3765 -75.7148
quadrupole: -1.8807 -2.1057 -3.2480
quadrupole: 4.7705 -2.7161 -2.0544 -1.8807 -2.1057 -3.2480
hfenergy: -541.5250468 hartree
pointgroup: C01 [X(C10H18O2)]
dipole: -0.0614312 1.0568498 -0.8415051 debye
polarizability: 138.9554197|-0.7497718|100.6103189|-1.7671201|0.5822933|95.8218716 unknown
InChI: InChI=1S/C10H18O2/c1-8(2)10-6-4-9(3,5-7-10)11-12-10/h8H,4-7H2,1-3H3
charge 0 multiplicity 1
30 atoms
O  -0.125854 -0.867894 1.05519
O  1.355308 -1.161926 0.669779
C  -0.709496 0.116111 0.068362
C  1.889996 0.012156 -0.111766
C  -0.090914 1.496154 0.41755
C  -0.275228 -0.317642 -1.350938
C  1.444275 1.30592 0.607923
C  1.25257 -0.057778 -1.522696
C  -2.235153 0.017123 0.361233
C  3.403501 -0.219964 -0.096931
C  -3.026555 1.164476 -0.314778
C  -2.829412 -1.359296 -0.021567
H  -0.54917 1.896122 1.340254
H  -0.302253 2.213312 -0.398252
H  -0.861161 0.228211 -2.112917
H  -0.491126 -1.393047 -1.465231
H  2.008757 2.169821 0.210381
H  1.69341 1.202432 1.678739
H  1.719221 -0.867953 -2.111011
H  1.443309 0.894108 -2.056006
H  -2.333967 0.136358 1.46111
H  3.898831 0.480918 -0.793667
H  3.817241 -0.067256 0.914503
H  3.638995 -1.250146 -0.418116
H  -2.939571 1.119108 -1.416859
H  -4.098902 1.072898 -0.063357
H  -2.689003 2.161835 0.017748
H  -2.85677 -1.495847 -1.118993
H  -3.867936 -1.440362 0.349029
H  -2.237544 -2.179851 0.417884
