program: Gaussian 09
title: 000138543
version: EM64L-G09RevD.01
frameworkgroup: C1[X(C11H20N2O2)]
method: RPBEPBE
basis: SDD
operation: Freq
keyword: #p
keyword: freq=noraman
keyword: PBEPBE/SDD
title: #p freq=noraman PBEPBE/SDD
converged: NO YES NO NO
title: Mulliken charges:
elementType: O O N N C C C C C C C C C C C H H H H H H H H H H H H H H H H H H H H
charge: -0.265953 -0.264710 -0.376651 -0.363446 -0.103959 -0.172252 -0.454527 -0.030665 -0.043238 0.117181 0.090852 -0.710554 -0.726981 -0.701000 -0.726123 0.242608 0.255882 0.222449 0.256556 0.246811 0.208875 0.349021 0.327253 0.217368 0.219673 0.232476 0.209062 0.231395 0.218140 0.201254 0.230608 0.214761 0.209760 0.225730 0.212342
chargesum: 0.00000
title: Mulliken charges with hydrogens summed into heavy atoms:
elementType: O O N N C C C C C C C C C C C
charge: -0.265953 -0.264710 -0.027630 -0.036193 0.138649 0.083630 0.024479 0.216146 0.165638 0.117181 0.090852 -0.041037 -0.068384 -0.054376 -0.078292
polarizability: 1.67599895e+02 7.22016371e+00 1.33996673e+02 -3.17227630e+00 -1.06157982e+00 1.07173428e+02
1716.lowfreq: -17.4006 -4.3389 -0.0005 -0.0003 0.0003 9.3155 21.1132 38.5280 59.6996
frequency: 12.9883 37.8881 59.6757 79.2265 85.1123 107.7745 155.4442 170.2977 196.1862 206.7607 233.4643 236.5776 261.1862 289.1084 300.8377 313.7694 367.8806 378.4996 384.6779 422.4255 443.4945 463.2888 494.4476 539.4881 588.2108 615.3773 619.6425 693.6287 711.8275 764.5229 783.9826 803.1369 831.8094 879.7925 898.9150 918.7410 922.2948 955.0358 956.7219 963.1116 974.5076 1015.3449 1038.0475 1069.5186 1111.6664 1124.5318 1131.9954 1166.2780 1182.5456 1195.4983 1235.3710 1249.7766 1259.8925 1271.4230 1293.1325 1314.8046 1318.2315 1332.5043 1342.0482 1356.6747 1368.9103 1378.6005 1381.3936 1393.4909 1397.8397 1399.1749 1417.0024 1435.6039 1459.5838 1466.4061 1467.8785 1476.2674 1479.8185 1483.9306 1490.5561 1491.1059 1496.1532 1624.7880 1626.2061 2939.1944 2959.2697 2967.5362 2970.0523 2972.1235 2976.8783 2991.0323 2993.4601 3006.6988 3049.7932 3057.4914 3060.9065 3061.0893 3066.7239 3072.4108 3074.7726 3078.5824 3078.8057 3508.1947 3518.4809
redmass: 4.0724 2.9191 2.6086 4.9687 3.2477 4.9805 3.4239 3.5921 1.0956 1.1506 1.2932 2.1240 3.4945 3.0976 1.0818 3.4975 2.2028 2.4044 2.5314 3.1918 7.2925 3.9111 3.0793 2.6995 2.7951 3.6208 2.5438 1.5799 1.7524 3.7747 3.5141 3.6241 3.3656 1.7977 2.6810 1.2416 1.1974 1.5451 1.6685 1.9051 2.0648 2.2904 2.0627 1.8491 2.2231 1.9505 1.9817 2.1657 2.0089 1.9497 1.2181 1.3341 1.2651 1.5765 1.5040 1.5458 1.5682 1.5241 1.4924 1.4280 1.5504 1.2183 1.2405 1.4887 1.9438 1.3877 1.5485 2.6024 1.0767 1.0485 1.0532 1.0525 1.0558 1.0474 1.0535 1.0549 1.0605 5.8512 5.7998 1.0807 1.0372 1.0789 1.0364 1.0373 1.0363 1.0655 1.0832 1.0851 1.0998 1.1000 1.0985 1.0995 1.0974 1.0991 1.0993 1.0998 1.0983 1.0755 1.0758
irintensity: 1.4714 0.0324 0.0251 1.0304 0.2519 3.2861 2.0911 0.6265 0.0919 0.0698 0.1331 0.9640 0.1162 1.7004 0.4700 7.8446 2.1117 5.6654 4.2566 10.9873 0.8871 5.6321 7.3698 4.6346 17.0802 5.5187 23.4984 9.3275 171.3876 18.1191 2.8864 0.5721 12.4537 12.1829 4.8302 0.9976 4.0766 3.9593 2.1631 0.8277 9.6273 4.6566 23.7491 3.2451 15.4711 3.0471 34.7681 4.5068 15.1629 5.1041 17.4944 80.6906 2.2341 19.2004 13.5309 19.9320 21.8267 0.5298 9.1696 10.2537 1.8282 21.6409 24.8496 72.6065 78.6953 55.9081 26.0476 2.0053 5.0380 3.1947 4.2833 5.0293 4.7069 24.5560 20.9458 23.3365 16.2331 328.4269 304.4292 12.6470 26.8048 15.0875 34.0296 24.4062 17.8636 30.9912 12.1906 8.1322 29.1768 12.7233 44.2149 27.2922 96.0829 27.4204 18.5458 31.7566 67.2236 19.9082 35.7941
temp: 298.150 k
press: 1.00000 atm
elementType: 8 8 7 7 6 6 6 6 6 6 6 6 6 6 6 1 1 1 1 1 1 1 1 1 1 1 1 1 1 1 1 1 1 1 1
symmnumber: 1
zpe: 791145.8 jmol-1
zpe.correction: 0.301332 hartree
zpe.thermalcorrener: 0.318188 hartree
zpe.thermalcorrenthalpy: 0.319132 hartree
zpe.thermalcorrgfe: 0.255849 hartree
zpe.sumelectzpe: -689.959184 hartree
zpe.sumelectthermal: -689.942328 hartree
zpe.sumelectthermalent: -689.941383 hartree
zpe.sumelectthermalfe: -690.004667 hartree
dipole: -0.2851 -0.1638 1.1342
dipole: 1.1809
quadrupole: -78.3957 -113.4940 -91.4368
quadrupole: -10.9254 0.2441 1.6207
quadrupole: 16.0465 -19.0518 3.0053 -10.9254 0.2441 1.6207
hfenergy: -690.2605154 hartree
pointgroup: C01 [X(C11H20N2O2)]
dipole: 0.0816149 -0.0663095 -0.4525356 debye
polarizability: 167.3428305|-5.818826|133.4863927|-7.5674219|0.9796135|107.9407718 unknown
InChI: InChI=1S/C11H20N2O2/c1-6(2)5-8-10(14)13-9(7(3)4)11(15)12-8/h6-9,12-13H,5H2,1-4H3
charge 0 multiplicity 1
35 atoms
O  0.469223 -2.466568 1.042112
O  -1.460431 2.670302 1.204005
N  0.288674 1.19885 0.802282
N  -1.298316 -0.995829 1.303763
C  0.88306 -0.117096 0.476028
C  -1.99781 0.29844 1.190285
C  2.328219 -0.242156 1.032293
C  -3.06124 0.328731 0.036816
C  3.46293 0.325211 0.130756
C  0.006659 -1.28715 0.972185
C  -1.032788 1.483721 1.061986
C  -2.416425 0.135864 -1.353386
C  -4.175288 -0.711818 0.291575
C  3.6269 -0.490154 -1.175458
C  3.322804 1.836352 -0.180862
H  0.92531 -0.239839 -0.628967
H  -2.547889 0.475821 2.136107
H  2.355427 0.243919 2.027711
H  2.512286 -1.32086 1.188399
H  -3.502628 1.343558 0.08831
H  4.396481 0.195629 0.71756
H  0.905422 2.013655 0.736075
H  -1.850278 -1.803084 1.609984
H  -1.91342 -0.846936 -1.426087
H  -3.188326 0.175445 -2.142855
H  -1.676521 0.92773 -1.571055
H  -3.792556 -1.746867 0.202946
H  -4.982133 -0.600209 -0.454638
H  -4.627583 -0.590141 1.294264
H  2.745666 -0.386091 -1.83761
H  3.759639 -1.566004 -0.960637
H  4.506892 -0.141296 -1.74677
H  2.462494 2.03515 -0.850213
H  4.222825 2.210015 -0.702605
H  3.203724 2.437306 0.7419
