program: Gaussian 09
title: 000138536
version: EM64L-G09RevD.01
frameworkgroup: C1[X(C4H3N3O3Si)]
method: RPBEPBE
basis: SDD
operation: Freq
keyword: #p
keyword: freq=noraman
keyword: PBEPBE/SDD
title: #p freq=noraman PBEPBE/SDD
converged: YES YES NO NO
title: Mulliken charges:
elementType: Si O O O N N N C C C C H H H
charge: 1.621674 -0.161534 -0.161491 -0.161494 -0.363491 -0.363503 -0.363470 -0.997340 0.050068 0.050119 0.050106 0.266791 0.266776 0.266788
chargesum: 0.00000
title: Mulliken charges with hydrogens summed into heavy atoms:
elementType: Si O O O N N N C C C C
charge: 1.621674 -0.161534 -0.161491 -0.161494 -0.363491 -0.363503 -0.363470 -0.196984 0.050068 0.050119 0.050106
polarizability: 9.96924050e+01 2.33984713e-03 9.96775101e+01 -4.31926485e-03 -2.72136151e-03 7.02061048e+01
1716.lowfreq: -3.5232 -1.2460 -0.0019 -0.0014 0.0014 5.2730 41.5079 41.7204 48.4746
frequency: 41.5074 41.7202 48.4745 85.2620 86.2695 103.7657 155.1655 212.2649 212.4094 282.6570 282.7001 334.0817 457.4810 549.3056 549.3274 551.4955 558.4451 560.3127 560.4069 606.7600 607.0506 770.9831 884.3817 885.1691 1327.2224 1402.1211 1405.5315 1405.5842 1441.9262 1442.1327 2316.8768 2316.9714 2357.0812 3003.7499 3113.8982 3114.0886
redmass: 13.1435 13.1670 13.5607 6.2564 6.2724 9.0325 1.0548 4.1635 4.1825 10.9442 10.9869 11.9263 7.9886 12.7339 12.7346 12.6977 12.6291 12.7613 12.7609 8.2752 8.3095 6.7700 1.4193 1.4175 1.2026 14.4916 14.5847 14.5834 1.0490 1.0491 12.6831 12.6830 12.7136 1.0348 1.0989 1.0989
irintensity: 0.4964 0.4944 0.9190 0.1900 0.1978 0.0000 0.0003 0.8410 0.7944 16.6480 16.6126 40.4747 45.8753 3.7001 3.7391 0.0022 78.8215 18.0941 18.2313 275.4319 275.9737 143.3599 189.0423 188.1743 35.6836 9.8780 48.3257 48.3744 3.9599 3.9511 1729.7577 1730.6234 485.4177 0.5775 5.3377 5.3362
temp: 298.150 k
press: 1.00000 atm
elementType: 14 8 8 8 7 7 7 6 6 6 6 1 1 1
symmnumber: 1
zpe: 203811.3 jmol-1
zpe.correction: 0.077628 hartree
zpe.thermalcorrener: 0.090173 hartree
zpe.thermalcorrenthalpy: 0.091117 hartree
zpe.thermalcorrgfe: 0.036268 hartree
zpe.sumelectzpe: -832.865554 hartree
zpe.sumelectthermal: -832.853009 hartree
zpe.sumelectthermalent: -832.852065 hartree
zpe.sumelectthermalfe: -832.906914 hartree
dipole: 0.0003 -0.0015 3.6985
dipole: 3.6985
quadrupole: -81.9908 -81.9806 -64.7058
quadrupole: -0.0018 -0.0020 -0.0036
quadrupole: -5.7651 -5.7548 11.5199 -0.0018 -0.0020 -0.0036
hfenergy: -832.9431815 hartree
pointgroup: C01 [X(C4H3N3O3Si1)]
dipole: 0.0000175 0.0005883 1.4551093 debye
dipolederiv: 3.224813 0.0000805 0.0004122 0.000222 3.22493 -0.000638 0.0010608 -0.0004409 2.2872124 -0.247049 0.1772606 0.0643035 0.1777482 -1.4316493 -0.4391266 0.0775524 -0.5280974 -0.4128262 -0.9811034 -0.6012863 0.3486524 -0.6015793 -0.6969119 0.2759333 0.4190618 0.3314909 -0.4134434 -1.2885245 0.4235656 -0.4134298 0.4237785 -0.3891777 0.1641181 -0.4966229 0.1970469 -0.4136125 -0.7637731 0.2402215 0.0828615 0.2402393 -2.3654682 -0.5637862 0.1195743 -0.8147531 -0.9823607 -1.7564342 -0.8132437 0.4476584 -0.8132472 -1.3719234 0.3540081 0.6466899 0.5115734 -0.9833425 -2.1719301 0.5728452 -0.5307996 0.5725198 -0.9556713 0.2106029 -0.7670752 0.3043422 -0.9839397 -0.4354149 0.0000798 -0.0002004 0.0001039 -0.4353295 0.0001073 -0.0000746 0.0000112 -0.4430063 0.3913366 -0.3131942 -0.117018 -0.3134592 2.4814615 0.7982144 -0.143437 0.9772493 0.7086482 1.6865621 1.0610224 -0.6336172 1.0611374 1.1849741 -0.5013464 -0.7757712 -0.6137041 0.7099763 2.2287331 -0.7473506 0.7512114 -0.7474149 0.6420155 -0.2981091 0.9191185 -0.3646998 0.7101747 0.1160962 0.0233582 0.00787 0.0233416 -0.0408583 -0.0542878 0.0198915 -0.1369054 0.0721973 0.0186859 -0.0796662 0.0430157 -0.0796872 0.0564954 0.0340492 0.108466 0.0857801 0.072165 -0.0219976 0.0563073 -0.0509202 0.0562971 0.097113 0.0202609 -0.1284341 0.0511066 0.0721575 unknown
polarizability: 99.6779683|0.0034965|99.6919296|0.0129076|-0.0191625|70.206122 unknown
InChI: InChI=1S/C4H3N3O3Si/c1-11(5-2-8,6-3-9)7-4-10/h1H3
charge 0 multiplicity 1
14 atoms
Si -0.000249 0.000459 0.77175
O  0.557655 -3.801491 -0.854398
O  3.012653 2.383994 -0.856337
O  -3.570675 1.417093 -0.857652
N  0.235779 -1.606736 0.141985
N  1.273688 1.008159 0.141841
N  -1.509709 0.599256 0.140751
C  -0.000378 0.000652 2.644727
C  0.396774 -2.702892 -0.365367
C  2.142257 1.69514 -0.366633
C  -2.539027 1.007556 -0.367854
H  -0.149529 1.023733 3.02974
H  -0.811645 -0.640285 3.029683
H  0.960404 -0.381638 3.029364
