program: Gaussian 09
title: 000138532
version: EM64L-G09RevD.01
frameworkgroup: C1[X(C11H10N2O3)]
method: RPBEPBE
basis: SDD
operation: Freq
keyword: #p
keyword: freq=noraman
keyword: PBEPBE/SDD
title: #p freq=noraman PBEPBE/SDD
converged: YES YES NO NO
title: Mulliken charges:
elementType: O O O N N C C C C C C C C C C C H H H H H H H H H H
charge: -0.199229 -0.254738 -0.233364 -0.126823 -0.039780 0.316118 -0.018598 0.261004 -0.399882 -0.347683 -0.370271 -0.224878 -0.227385 -0.229283 0.304425 -0.742101 0.269921 0.265736 0.265003 0.272865 0.233051 0.232538 0.233453 0.258495 0.252362 0.249045
chargesum: 0.00000
title: Mulliken charges with hydrogens summed into heavy atoms:
elementType: O O O N N C C C C C C C C C C C
charge: -0.199229 -0.254738 -0.233364 -0.126823 -0.039780 0.316118 -0.018598 0.261004 0.135775 -0.082680 -0.097407 0.008172 0.005154 0.004170 0.304425 0.017801
polarizability: 2.33194933e+02 -7.61181873e+00 1.25972111e+02 -1.00845576e+01 1.05646425e+00 7.97355824e+01
1716.lowfreq: -5.3096 -0.0010 -0.0008 -0.0003 3.7066 5.9748 17.0452 28.8974 33.6538
frequency: 16.8786 28.8814 33.6416 42.7551 74.3529 102.3611 104.5262 183.8608 226.0512 250.9348 295.0243 314.7520 366.6597 402.4799 432.3188 482.3515 488.3264 560.1711 593.1625 614.5851 643.0696 676.7400 699.9276 712.9150 736.7246 787.2848 792.0203 814.4010 862.9019 897.1159 917.8882 939.3701 947.7169 989.5413 992.9513 993.4418 1006.7454 1013.6796 1028.6468 1044.5089 1079.1574 1099.9049 1171.7965 1175.0561 1185.5914 1189.2439 1254.8361 1267.6899 1329.5918 1340.4982 1385.6794 1386.3666 1418.1244 1446.3055 1452.2770 1453.3469 1454.2081 1508.7737 1552.1981 1589.9338 1619.1646 1671.2128 3011.8681 3015.9238 3100.3342 3116.1929 3131.5972 3142.6606 3148.1322 3154.5447 3164.8897 3173.9040
redmass: 5.3059 7.4065 1.3661 2.7186 4.1339 5.4919 5.0466 6.2174 6.5283 5.9224 2.8795 4.2374 6.7356 2.8323 4.6028 4.9531 3.9413 3.1579 5.5235 6.4365 6.0555 6.6711 1.9757 3.8670 4.8898 3.6605 2.5911 13.6242 1.2471 8.1668 8.5007 4.9005 1.4264 6.1832 1.3883 2.1644 1.3298 3.2773 2.2437 1.6579 1.7031 3.2618 2.6137 1.0579 2.1103 1.3477 2.0627 2.3722 1.4609 1.2912 1.3334 6.0438 3.2075 2.4315 1.0634 1.0469 1.0831 3.7666 9.5166 6.3754 6.0881 9.3475 1.0367 1.0621 1.0974 1.1008 1.0854 1.0888 1.1012 1.0935 1.0967 1.1006
irintensity: 0.3953 0.0610 2.5112 0.5665 1.5831 1.3510 1.3388 5.5849 5.6605 0.4980 10.3140 2.6760 0.9117 0.0091 10.3100 0.2045 3.6968 2.1007 10.2654 0.0744 1.4798 16.5532 40.0602 52.5274 34.0375 21.9303 32.0915 29.5643 0.0184 10.3467 13.8385 64.7132 6.0441 1.1580 0.9514 112.8373 0.4786 1.7494 22.2998 9.7367 14.6682 14.9604 102.0346 1.2573 246.4342 34.0542 15.3278 11.4177 7.8382 6.6171 47.7305 20.5530 133.0767 14.8889 32.6599 18.3360 19.1091 27.5595 50.3572 1.9005 3.4374 198.8931 0.8783 36.6781 5.1118 5.9277 0.0017 9.7161 9.2649 16.8072 13.9750 16.4577
temp: 298.150 k
press: 1.00000 atm
elementType: 8 8 8 7 7 6 6 6 6 6 6 6 6 6 6 6 1 1 1 1 1 1 1 1 1 1
symmnumber: 1
zpe: 504241.9 jmol-1
zpe.correction: 0.192056 hartree
zpe.thermalcorrener: 0.206513 hartree
zpe.thermalcorrenthalpy: 0.207457 hartree
zpe.thermalcorrgfe: 0.146758 hartree
zpe.sumelectzpe: -759.160610 hartree
zpe.sumelectthermal: -759.146152 hartree
zpe.sumelectthermalent: -759.145208 hartree
zpe.sumelectthermalfe: -759.205907 hartree
dipole: -1.0730 1.7862 1.6330
dipole: 2.6474
quadrupole: -74.3753 -90.2075 -94.8822
quadrupole: 3.1605 9.0326 -3.3215
quadrupole: 12.1131 -3.7192 -8.3939 3.1605 9.0326 -3.3215
hfenergy: -759.3526657 hartree
pointgroup: C01 [X(C11H10N2O3)]
dipole: -0.4102741 -0.9382334 -0.1903547 debye
dipolederiv: -0.8746151 -0.1889041 0.0080213 0.0676136 -0.3142711 0.1374834 -0.1797496 0.1070531 -0.1477519 -1.5987484 -0.2889082 0.2030857 -0.3928129 -0.4613105 0.0234261 0.3880485 0.0019731 -0.4896119 -0.8096482 -0.1385274 0.0580429 -0.4246378 -0.5466383 -0.1813088 -0.206734 -0.3126372 -0.6622956 -1.0158079 -0.0547098 -0.0230347 0.1112726 -0.2821019 0.0574165 -0.1124768 0.0393647 -0.2287668 -0.0129011 0.0970183 -0.0065784 -0.1886888 -0.1791876 -0.0106474 0.1377727 0.0271053 -0.1490717 -0.1851783 -0.0402634 -0.0037677 0.0092897 0.0108206 0.0049487 -0.0358758 0.0017128 0.0177928 1.2928697 0.0868474 0.0729545 0.0409408 0.1144669 -0.0143845 0.1007888 -0.0075027 0.1127088 0.7304188 0.1237854 -0.0177431 -0.0330674 0.4186027 -0.1518695 0.1118907 -0.121827 0.1237027 0.577481 -0.0380273 -0.0703317 -0.2686967 0.220602 0.0070259 -0.448306 -0.047502 0.3485447 0.0047735 0.1003045 -0.0358804 -0.0484987 -0.0171966 -0.062628 0.0424685 -0.0473715 -0.0986486 0.0041185 -0.0738239 0.0581751 0.0711373 -0.0395197 -0.0421132 -0.0224722 -0.0572468 -0.1002079 -0.0667707 -0.1385803 0.0863239 -0.1868722 -0.0336946 -0.0832988 0.1120108 -0.0791952 -0.0927893 -0.1184749 0.1127906 -0.055535 0.1436215 0.0684109 -0.1043932 -0.072736 -0.1059676 -0.1031607 0.0793003 0.0233954 0.0172544 0.0472048 -0.0224888 -0.060696 0.0018044 -0.0641568 -0.110813 1.7954219 0.4753611 -0.3231643 0.9571914 0.7030038 0.2328219 -0.0958279 0.3742162 0.9278473 -0.1282213 0.0198728 0.1200183 0.0196823 -0.0121535 -0.117149 0.2233034 -0.0843081 -0.3046469 0.113342 -0.0037676 -0.0682863 0.1105716 0.059407 -0.0936452 0.0930583 -0.0208426 0.0655249 0.006413 -0.0269716 0.0576161 0.0323728 0.0068266 0.0796046 0.0764736 0.046496 0.0601102 0.1050804 -0.0623698 0.0254082 -0.051403 0.0248137 0.0656031 0.0214185 0.0633681 0.1235022 0.093398 0.0633993 -0.0448174 0.0700369 0.0645534 0.0560281 -0.0460285 0.0571525 0.119994 -0.0104175 0.0705233 -0.057629 0.0901693 0.0169458 0.0870004 -0.0698951 0.0851489 0.1039681 0.0403914 -0.0622355 0.0201615 -0.0876646 -0.0385319 0.0971466 0.0326317 0.0992143 0.1087105 -0.1261238 -0.0406699 -0.0119354 -0.0409489 0.1022696 0.0262245 -0.0128017 0.0262144 0.1439763 0.0335126 0.0430543 -0.0821651 0.0158757 0.1261342 0.0504164 -0.0611122 0.02392 0.0213942 0.1128259 0.0160542 0.0381756 0.041388 -0.0580376 -0.0030339 0.0040965 0.0208961 0.1177735 -0.0424398 -0.0746477 0.0356312 -0.1050775 0.0682751 0.0000211 0.0182495 -0.0252781 0.0922141 unknown
polarizability: 232.9084792|13.2792673|115.6214072|1.5190543|-19.8610993|90.3727399 unknown
InChI: InChI=1S/C11H10N2O3/c1-8(14)15-7-10-12-11(13-16-10)9-5-3-2-4-6-9/h2-6H,7H2,1H3
charge 0 multiplicity 1
26 atoms
O  1.153704 1.120761 -0.184076
O  3.439134 -0.816611 -0.253421
O  4.996837 0.699567 0.617002
N  0.051369 -0.688077 0.642309
N  -0.270768 1.326428 -0.482014
C  -2.305886 -0.020971 -0.003968
C  -0.857812 0.218473 0.045038
C  1.235237 -0.112721 0.484575
C  2.573217 -0.596932 0.934075
C  -3.178592 0.916861 -0.619733
C  -2.83477 -1.205827 0.572667
C  -4.564482 0.667089 -0.655483
C  -4.22366 -1.448342 0.53318
C  -5.091622 -0.514678 -0.07991
C  4.64249 -0.071195 -0.297238
C  5.377196 -0.370394 -1.581158
H  3.06993 0.131429 1.60217
H  2.448297 -1.566342 1.438603
H  -2.763861 1.828478 -1.062323
H  -2.148673 -1.917529 1.041976
H  -5.235122 1.391156 -1.130444
H  -4.628741 -2.36318 0.978812
H  -6.170172 -0.704808 -0.109642
H  4.741321 -0.114679 -2.445901
H  5.603043 -1.448613 -1.647194
H  6.309987 0.20946 -1.6177
