program: Gaussian 09
title: 000138528
version: EM64L-G09RevD.01
frameworkgroup: C1[X(C6H10N2)]
method: RPBEPBE
basis: SDD
operation: Freq
keyword: #pfreq=noraman
keyword: PBEPBE/SDD
title: #p freq=noraman PBEPBE/SDD
converged: YES YES NO NO
title: Mulliken charges:
elementType: N N C C C C C C H H H H H H H H H H
charge: -0.430196 -0.091161 0.070991 0.291952 0.107133 -0.799394 -0.780441 -0.765569 0.315279 0.224481 0.229776 0.228563 0.219466 0.245074 0.244064 0.243751 0.223165 0.223066
chargesum: 0.00000
title: Mulliken charges with hydrogens summed into heavy atoms:
elementType: N N C C C C C C
charge: -0.114917 -0.091161 0.070991 0.291952 0.107133 -0.116573 -0.071838 -0.075587
polarizability: 9.42471253e+01 1.98445920e+00 8.17224471e+01 -8.89719571e-02 7.85325840e-02 4.82069137e+01
1716.lowfreq: -24.6821 -11.3924 -0.0005 -0.0004 -0.0001 6.9123 12.5029 53.7721 110.8347
frequency: -22.9296 53.7584 110.8289 153.8857 223.6449 250.5819 269.4614 326.2863 452.7089 562.0946 566.5442 649.4855 675.6931 680.6617 748.1657 935.4613 962.8760 980.4156 1027.3448 1038.4611 1055.8069 1093.9144 1134.3365 1217.0804 1286.8364 1380.2630 1393.5094 1401.4230 1409.3788 1445.0971 1460.1566 1467.1907 1470.4251 1474.3270 1478.0536 1480.0587 1502.6940 1594.3311 2966.6066 2974.9595 2977.8995 3038.1425 3048.0151 3058.2548 3072.7425 3076.7975 3099.6467 3615.6762
redmass: 1.0270 1.0266 1.0456 2.5780 2.4658 2.5303 3.4532 3.7901 2.7379 4.1818 1.6283 2.3456 3.9681 4.0496 4.1710 2.0817 1.6562 1.6355 1.3617 1.4329 1.5709 2.7736 3.5503 4.6936 2.5875 2.0732 1.2752 1.2280 1.2676 2.0423 1.0491 1.0475 1.5883 1.0571 1.0717 1.8205 1.8386 5.3978 1.0373 1.0378 1.0367 1.0979 1.0977 1.0984 1.0978 1.0984 1.0974 1.0818
irintensity: 0.1591 0.0249 0.1072 2.8341 0.5920 1.7587 6.9937 1.3723 3.0506 1.7867 68.4820 37.0085 2.7030 3.3475 2.9004 8.6887 0.9802 15.6554 6.9454 0.2376 0.7553 11.7663 9.7836 8.0429 15.6586 1.3285 10.3297 10.6217 7.4716 27.0563 17.0250 18.8086 2.9079 7.0356 0.4375 14.1070 22.8939 15.6092 44.8280 43.4869 28.4034 31.4727 20.7978 18.3717 27.0592 20.9383 13.9962 54.0971
temp: 298.150 k
press: 1.00000 atm
elementType: 7 7 6 6 6 6 6 6 1 1 1 1 1 1 1 1 1 1
symmnumber: 1
zpe: 396813.2 jmol-1
zpe.correction: 0.151138 hartree
zpe.thermalcorrener: 0.159479 hartree
zpe.thermalcorrenthalpy: 0.160423 hartree
zpe.thermalcorrgfe: 0.117974 hartree
zpe.sumelectzpe: -343.519295 hartree
zpe.sumelectthermal: -343.510954 hartree
zpe.sumelectthermalent: -343.510010 hartree
zpe.sumelectthermalfe: -343.552459 hartree
dipole: -2.4061 1.2971 0.0110
dipole: 2.7335
quadrupole: -42.3524 -47.8042 -50.5135
quadrupole: 5.7807 0.0029 0.0116
quadrupole: 4.5376 -0.9142 -3.6234 5.7807 0.0029 0.0116
hfenergy: -343.6704334 hartree
pointgroup: C01 [X(C6H10N2)]
dipole: -0.9745003 -0.453768 -0.0317719 debye
dipolederiv: -0.2760509 0.2532954 0.0060715 0.275742 -0.4298643 0.0009017 0.0019688 0.0046816 -0.2364084 -0.1785258 -0.2836217 -0.0074159 -0.176346 -0.407292 -0.0060854 -0.0033422 -0.0100985 -0.2232285 -0.3724727 0.0481131 -0.0031006 0.0145572 0.0978042 0.0063969 -0.0059306 0.0098381 -0.1166886 0.2058991 -0.02186 0.0067662 -0.1994375 0.3407865 0.0028772 0.0230226 0.0042037 -0.0481531 0.4741863 -0.0233398 0.0086233 0.0756665 0.0824852 0.0027075 0.0096913 0.002403 -0.0525828 0.0779998 0.0061736 0.0003537 -0.0099195 0.0061493 -0.0007212 0.0013554 -0.005329 0.1113104 -0.0399595 -0.0391799 0.0005305 -0.0523328 0.0491677 0.0031712 -0.0199899 -0.0007655 0.1022017 -0.0834326 0.0282693 -0.0028765 0.0345875 0.028862 -0.0006098 -0.0019297 -0.0007854 0.0956587 0.1546326 0.0188913 -0.0019932 -0.0055591 0.2183685 -0.0021358 -0.0022809 -0.0035718 0.3314415 -0.1260225 -0.1336333 0.0015212 -0.0418709 0.0399014 -0.0013823 0.0025192 0.00193 0.1025787 0.0536423 0.0664683 0.101304 0.0320578 -0.013839 -0.0498383 0.088909 -0.1140008 -0.0629442 0.0479862 0.0753151 -0.1033965 0.037898 -0.0160721 0.049569 -0.0917546 0.1128171 -0.0500454 0.0069849 0.0531327 0.0052605 0.1508816 -0.0996225 -0.0243491 0.0168521 -0.0214829 0.1142113 -0.0108195 -0.026218 -0.0275616 -0.0591423 0.0670892 -0.0914223 -0.0984169 -0.0841025 -0.0604147 0.0092764 -0.0297685 0.0143215 -0.0784151 0.0205516 0.1104499 0.0780536 0.1036062 -0.0125995 0.0068453 -0.0602648 -0.0033501 -0.1559823 -0.0325978 -0.0064749 -0.0055817 -0.0045509 0.1175736 0.0271145 0.0321195 -0.009147 0.0784495 0.0185026 0.1215137 -0.073909 0.1188301 -0.0521969 0.0227161 0.0361076 0.014089 0.0791655 0.0296196 -0.1145681 0.0807636 -0.1136224 -0.0597137 unknown
polarizability: 93.9546675|-2.7190092|81.9803345|0.8858909|0.7206341|48.241484 unknown
InChI: InChI=1S/C6H10N2/c1-4-5(2)7-8-6(4)3/h7H,1-3H3
charge 0 multiplicity 1
18 atoms
N  -0.60256 1.468974 0.030047
N  0.788021 1.486814 0.05479
C  -0.036195 -0.686515 -0.003638
C  -1.139119 0.189718 -0.00497
C  1.128208 0.158762 0.033692
C  -0.066535 -2.193138 -0.035842
C  -2.620518 -0.067437 -0.042291
C  2.573926 -0.253833 0.051325
H  -1.102235 2.355126 0.04038
H  -1.102347 -2.575905 -0.026532
H  0.426701 -2.593173 -0.942828
H  0.458085 -2.63068 0.835222
H  -3.19454 0.870574 0.064833
H  -2.92846 -0.538976 -0.994031
H  -2.931853 -0.742131 0.775807
H  3.218185 0.640192 0.084202
H  2.806137 -0.882131 0.932261
H  2.8398 -0.841041 -0.848227
