program: Gaussian 09
title: 000138527
version: EM64L-G09RevD.01
frameworkgroup: C1[X(C17H26O3)]
method: RPBEPBE
basis: SDD
operation: Freq
keyword: #pfreq=noraman
keyword: PBEPBE/SDD
title: #p freq=noraman PBEPBE/SDD
converged: YES YES NO NO
title: Mulliken charges:
elementType: O O O C C C C C C C C C C C C C C C C C H H H H H H H H H H H H H H H H H H H H H H H H H H
charge: -0.255438 -0.445985 -0.262555 -0.384117 -0.381091 -0.379924 -0.373188 -0.376456 -0.353063 -0.406182 -0.356820 -0.323205 -0.695997 0.368213 -0.334365 -0.367168 -0.357031 -0.302734 0.250067 0.107014 0.194509 0.192875 0.192504 0.193590 0.196189 0.197616 0.189383 0.190337 0.194640 0.191898 0.187759 0.188350 0.218258 0.216869 0.194765 0.195050 0.212054 0.213123 0.209833 0.209778 0.215586 0.254507 0.255627 0.268618 0.275195 0.381111
chargesum: 0.00000
title: Mulliken charges with hydrogens summed into heavy atoms:
elementType: O O O C C C C C C C C C C C C C C C C C
charge: -0.255438 -0.064874 -0.262555 0.003267 0.005004 0.013882 0.006532 0.010082 0.023045 0.028945 0.032994 0.101972 -0.060800 0.368213 -0.079857 -0.111541 -0.088413 -0.027540 0.250067 0.107014
polarizability: 3.17974472e+02 8.73618421e+00 1.78982252e+02 -2.47839787e+00 9.83943991e-01 1.21606389e+02
1716.lowfreq: -4.2538 -0.0013 0.0004 0.0015 4.5958 9.8708 17.8694 21.4413 30.2403
frequency: 8.9208 21.3479 29.8260 40.4357 60.0788 63.0441 74.9977 80.4351 102.2596 115.3739 120.1897 131.0496 133.7827 145.1135 153.4673 163.9296 180.2212 224.9686 234.2109 271.5517 288.4381 320.7924 367.2035 405.5737 417.6507 445.7211 477.3385 488.2235 498.4207 521.3023 581.1001 585.0808 628.1254 684.8226 705.6177 720.6866 724.6180 736.6618 756.7227 761.2901 799.5953 807.0896 827.8813 851.1685 856.1903 887.7607 910.5957 957.0909 971.0915 978.3850 987.7599 989.2209 994.0058 1002.7933 1018.8052 1022.4952 1031.6022 1056.7514 1068.2660 1080.4400 1081.7329 1095.2621 1118.2289 1126.0393 1147.4283 1150.3246 1183.7668 1184.6055 1210.7055 1211.3390 1234.2432 1242.6882 1246.9595 1270.6800 1278.8027 1279.8601 1286.6474 1289.7190 1296.4214 1299.7547 1302.7828 1311.4137 1321.7296 1337.5246 1353.2548 1355.7611 1359.5893 1375.3940 1385.5325 1387.6189 1432.5844 1460.7004 1460.9179 1464.4028 1466.7120 1469.2170 1473.0008 1475.7757 1477.8786 1482.9793 1487.5534 1489.6127 1500.2514 1573.3647 1620.7994 1640.6905 2949.9283 2950.3941 2951.9065 2953.0620 2955.3917 2958.9002 2965.1467 2968.6343 2971.5411 2983.5942 2988.4656 2995.0484 2995.4159 3004.4411 3012.1436 3018.0370 3031.0936 3041.6645 3064.4918 3068.0374 3070.7045 3150.0112 3160.5881 3170.3805 3182.8617 3533.5849
redmass: 3.9062 4.5014 3.3263 2.3181 4.1111 3.5520 2.5741 2.6685 3.2718 1.8205 4.4143 3.0203 5.1878 2.1000 2.0785 2.3754 4.8018 1.1379 4.0040 4.5509 5.8825 3.6720 5.0336 3.6626 2.9811 4.3624 3.6560 3.6023 2.7127 4.1906 5.0896 1.2144 7.0550 3.5524 5.4875 1.0598 1.0731 1.0954 4.5571 1.1287 1.1724 6.5657 1.2758 1.2793 1.5439 1.8946 1.2100 7.9063 1.1793 1.3504 1.3457 4.9977 4.3904 3.9672 2.7427 1.0867 3.7073 3.0147 2.8183 2.0859 2.2511 2.4489 1.3182 3.0298 1.4022 1.6090 1.7722 1.3126 1.2901 1.4744 3.2662 1.3409 1.3059 1.2478 1.0242 1.2966 1.0643 1.1389 1.0935 1.1213 1.2912 1.3348 2.9427 1.4126 1.5705 1.6602 1.6284 2.5074 2.1340 1.2173 4.3883 1.0744 1.0736 1.0701 1.0744 1.0857 1.0929 1.0433 1.0997 1.1080 1.1101 1.1259 2.2228 7.5924 6.3242 8.4226 1.0588 1.0586 1.0563 1.0593 1.0582 1.0592 1.0589 1.0585 1.0366 1.0965 1.0979 1.0992 1.0600 1.1025 1.1059 1.1048 1.1051 1.1048 1.1053 1.1007 1.0993 1.0882 1.0886 1.0960 1.0972 1.0641
irintensity: 0.0930 0.0847 0.0837 0.0060 0.2566 0.6892 0.4893 0.6998 0.0430 0.2417 0.8691 0.0578 0.1084 1.1891 0.0282 2.2377 0.8982 0.0012 0.0738 3.0261 5.5658 0.1175 2.3363 0.2535 0.2634 3.9426 1.5154 4.7524 36.5878 1.2006 79.3768 80.8680 3.8405 70.7628 2.8490 16.5433 0.1436 6.4079 22.9368 0.0642 4.0644 8.3789 2.9844 10.5266 50.6295 5.7346 0.0701 114.1479 0.9511 1.2771 0.0259 47.3643 119.9569 0.0499 188.4446 0.0944 6.1406 1.0236 3.2926 0.1712 0.6540 23.0221 12.5735 8.5627 1.4754 247.6201 0.4126 33.5252 17.6150 0.8952 296.6145 0.0732 6.4910 0.0956 0.1180 2.2261 0.5850 0.0890 0.0347 0.1994 2.8330 0.0889 178.3899 0.2581 0.4294 0.1722 0.6949 4.5280 54.5174 10.6316 2.1758 0.0076 0.0026 0.0865 0.0778 7.9228 3.4318 12.3004 16.4888 5.5118 11.9178 53.3938 52.5048 0.0224 338.5467 287.7934 0.1844 0.7275 9.7005 0.2483 17.8569 0.3437 42.6595 205.2569 37.4167 0.0684 0.3643 1.4326 37.1832 1.1527 20.4068 0.6520 1.3462 166.4342 93.7809 104.1522 55.6731 2.9944 2.1424 11.6730 2.8045 48.9888
temp: 298.150 k
press: 1.00000 atm
elementType: 8 8 8 6 6 6 6 6 6 6 6 6 6 6 6 6 6 6 6 6 1 1 1 1 1 1 1 1 1 1 1 1 1 1 1 1 1 1 1 1 1 1 1 1 1 1
symmnumber: 1
zpe: 1036966.8 jmol-1
zpe.correction: 0.394960 hartree
zpe.thermalcorrener: 0.417572 hartree
zpe.thermalcorrenthalpy: 0.418516 hartree
zpe.thermalcorrgfe: 0.338776 hartree
zpe.sumelectzpe: -887.533391 hartree
zpe.sumelectthermal: -887.510779 hartree
zpe.sumelectthermalent: -887.509835 hartree
zpe.sumelectthermalfe: -887.589575 hartree
dipole: -3.6268 -0.5183 0.0641
dipole: 3.6642
quadrupole: -138.1294 -125.6496 -123.5708
quadrupole: -13.0419 -0.4538 0.2246
quadrupole: -9.0128 3.4670 5.5458 -13.0419 -0.4538 0.2246
hfenergy: -887.9283508 hartree
pointgroup: C01 [X(C17H26O3)]
dipole: 1.4266149 0.1611448 0.1303812 debye
polarizability: 317.8498834|5.1224094|169.8318795|9.1231499|20.9416185|130.8813493 unknown
InChI: InChI=1S/C17H26O3/c1-2-3-4-5-6-7-8-9-14-20-16-12-10-15(11-13-16)17(18)19/h10-13,18H,2-9,14H2,1H3
charge 0 multiplicity 1
46 atoms
O  -1.809385 0.882284 0.396246
O  -8.172792 0.623233 -0.051149
O  -7.737702 -1.481951 -0.930625
C  4.390067 -0.427802 -0.039371
C  5.734087 0.285062 0.232506
C  3.160243 0.439297 0.310855
C  6.967633 -0.575414 -0.122508
C  1.814487 -0.261303 0.016099
C  8.310406 0.145275 0.134558
C  0.596087 0.62443 0.364719
C  9.545364 -0.712623 -0.22383
C  -0.729315 -0.063228 0.034601
C  10.881562 0.018988 0.028737
C  -3.130308 0.500598 0.165079
C  -3.521047 -0.74856 -0.389663
C  -4.112862 1.461828 0.525714
C  -4.888393 -1.020506 -0.578738
C  -5.472482 1.179807 0.332965
C  -5.875847 -0.066828 -0.222971
C  -7.297281 -0.408269 -0.446184
H  4.352228 -1.373072 0.541565
H  4.341254 -0.718572 -1.1098
H  5.769229 1.23118 -0.347325
H  5.7855 0.575289 1.302874
H  3.208119 1.390105 -0.259661
H  3.200815 0.718314 1.384287
H  6.911507 -0.873098 -1.190746
H  6.939474 -1.517714 0.463998
H  1.764163 -1.211213 0.588174
H  1.77855 -0.539978 -1.058005
H  8.338712 1.087958 -0.451391
H  8.369768 0.442498 1.202711
H  0.609395 0.88117 1.441205
H  0.650969 1.578205 -0.194268
H  9.482773 -1.012941 -1.289904
H  9.519646 -1.652299 0.36518
H  -0.796463 -0.30098 -1.047217
H  -0.852327 -1.000417 0.615768
H  10.982475 0.303417 1.093285
H  10.945042 0.945719 -0.572443
H  11.748067 -0.615035 -0.235099
H  -2.777894 -1.499799 -0.670654
H  -3.780456 2.413431 0.95069
H  -5.213723 -1.975406 -1.004877
H  -6.235681 1.91316 0.60676
H  -9.104663 0.32546 -0.229246
