program: Gaussian 09
title: 000138524
version: EM64L-G09RevD.01
frameworkgroup: C1[X(C13H17NO2S)]
method: RPBEPBE
basis: SDD
operation: Freq
keyword: #p
keyword: freq=noraman
keyword: PBEPBE/SDD
title: #p freq=noraman PBEPBE/SDD
converged: YES YES NO NO
title: Mulliken charges:
elementType: S O O N C C C C C C C C C C C C C H H H H H H H H H H H H H H H H H
charge: 0.982977 -0.539077 -0.533247 -0.298438 -0.125861 -0.181735 -0.451939 -0.458850 -0.440269 -0.424246 -0.411501 -0.066492 -0.238594 -0.248880 -0.219280 -0.214637 -0.217763 0.231917 0.301271 0.251660 0.210616 0.206464 0.226914 0.230690 0.224820 0.221108 0.212083 0.212574 0.263283 0.286441 0.287261 0.241315 0.241819 0.237596
chargesum: 0.00000
title: Mulliken charges with hydrogens summed into heavy atoms:
elementType: S O O N C C C C C C C C C C C C C
charge: 0.982977 -0.539077 -0.533247 -0.298438 0.106056 0.119535 0.010337 -0.025472 0.015241 0.008944 0.064356 -0.066492 0.047848 0.038381 0.022035 0.027182 0.019834
polarizability: 2.05087893e+02 1.75382830e+01 1.51409151e+02 -4.70376894e+00 5.71492212e+00 1.61065575e+02
1716.lowfreq: -16.6003 -2.6668 -0.0012 0.0008 0.0017 5.9936 22.2586 39.5891 49.2558
frequency: 19.2826 39.4413 49.1238 97.6316 129.2872 166.0587 179.1428 183.4497 228.8968 242.3736 276.8752 279.4835 341.7226 358.6911 379.8036 401.6676 403.5708 436.4701 458.2949 459.8145 507.4178 567.5769 603.2889 649.8674 691.7732 729.0553 751.7340 756.2483 769.6779 792.3489 804.7253 818.4478 852.9295 878.2267 880.9180 907.8274 927.6689 931.8141 951.2882 960.5006 978.3484 982.5956 999.7676 1003.5412 1006.5505 1014.8044 1027.1063 1044.7258 1054.1526 1075.9134 1081.7926 1095.3930 1147.5199 1158.6980 1172.4493 1176.3947 1190.1565 1202.1677 1223.9036 1238.8072 1247.8322 1283.8078 1298.0939 1301.1237 1310.0110 1316.6344 1325.4457 1341.7790 1350.5221 1382.7109 1434.3655 1450.0576 1450.9034 1460.7236 1467.5936 1475.2026 1496.5029 1576.0916 1601.1009 2915.7337 2991.9446 2994.8774 3002.9397 3011.1840 3034.8672 3048.8953 3054.7008 3065.5989 3067.6822 3076.6044 3090.7079 3135.7510 3145.2127 3154.4622 3162.7730 3173.0933
redmass: 3.5418 4.5013 4.2810 4.3590 5.7239 4.6621 4.5124 4.8240 3.3727 9.0026 2.8645 3.8823 1.9838 5.7945 6.5656 2.6505 2.8333 5.8726 3.8165 3.6387 4.1882 3.5159 6.4700 7.0463 2.4441 3.6856 2.3111 1.4061 1.6946 3.5418 5.1182 3.2246 1.2415 2.5253 2.0691 2.5811 2.2288 1.3482 7.1694 1.8640 5.5827 1.4198 1.9192 1.3441 4.4462 1.7779 2.2692 2.0360 1.7102 1.5574 1.6183 1.6215 1.4718 1.2623 1.0564 1.1258 1.4029 1.7001 1.4735 1.1640 1.5153 1.3356 1.5670 1.3073 1.4523 1.5014 1.3008 1.3503 1.3113 8.5509 2.2258 1.0905 2.0210 1.0883 1.0782 1.0894 1.0841 5.7985 6.9045 1.0682 1.0607 1.0597 1.0635 1.0629 1.0883 1.1015 1.0989 1.0959 1.0914 1.1007 1.1013 1.0856 1.0882 1.0925 1.0967 1.1016
irintensity: 0.2305 0.4586 0.3220 1.0119 2.2215 0.2300 0.5458 3.9287 1.0598 4.7826 1.3641 1.2904 0.2881 1.9040 19.6712 0.7972 0.0247 59.0800 3.4437 35.1874 77.7817 14.9573 0.0038 4.7284 32.4673 0.6356 0.0980 61.0275 2.2588 6.8852 70.2370 42.7689 0.3202 8.0805 1.5087 20.2258 4.3796 0.7674 49.7281 0.6206 2.6779 0.3699 3.2636 0.4492 0.9109 9.4814 3.8453 21.9573 8.0190 3.9623 4.5514 5.8939 4.0230 3.4548 0.0487 4.9470 7.4614 24.1826 16.7855 10.7280 11.0700 0.1133 2.8080 3.8831 3.7163 2.5691 2.9069 1.5669 0.2415 3.7597 16.8198 8.2484 12.3318 15.8440 2.6187 15.5560 13.5791 4.6594 0.4116 37.3768 33.2028 23.8089 35.8812 36.7136 63.5981 15.4763 19.2633 17.3675 1.7535 58.1683 22.6180 0.7077 9.3322 1.3864 5.1576 30.0028
temp: 298.150 k
press: 1.00000 atm
elementType: 16 8 8 7 6 6 6 6 6 6 6 6 6 6 6 6 6 1 1 1 1 1 1 1 1 1 1 1 1 1 1 1 1 1
symmnumber: 1
zpe: 726353.0 jmol-1
zpe.correction: 0.276653 hartree
zpe.thermalcorrener: 0.292181 hartree
zpe.thermalcorrenthalpy: 0.293125 hartree
zpe.thermalcorrgfe: 0.232814 hartree
zpe.sumelectzpe: -1107.383804 hartree
zpe.sumelectthermal: -1107.368276 hartree
zpe.sumelectthermalent: -1107.367332 hartree
zpe.sumelectthermalfe: -1107.427643 hartree
dipole: 0.2768 -6.9335 1.3632
dipole: 7.0716
quadrupole: -94.1342 -122.9926 -105.4530
quadrupole: 7.6110 -1.8054 3.4402
quadrupole: 13.3924 -15.4660 2.0736 7.6110 -1.8054 3.4402
hfenergy: -1107.6604575 hartree
pointgroup: C01 [X(C13H17N1O2S1)]
dipole: -0.0338476 2.7319279 0.5253739 debye
polarizability: 206.0217082|16.0737861|150.4628181|4.3071188|-5.8590543|161.0780916 unknown
InChI: InChI=1S/C13H17NO2S/c15-17(16,13-4-2-1-3-5-13)14-9-8-11-6-7-12(14)10-11/h1-5,11-12H,6-10H2
charge 0 multiplicity 1
34 atoms
S  0.40539 -1.660561 -0.256696
O  0.385508 -2.081117 -1.830217
O  0.612426 -2.729129 0.951804
N  -1.283675 -0.900842 0.069611
C  -3.427055 0.903606 0.417745
C  -1.818171 -0.066392 -1.051097
C  -3.353285 -0.036724 -0.815093
C  -2.507774 2.089759 -0.017066
C  -1.436825 1.449115 -0.970004
C  -2.852704 0.144572 1.645109
C  -1.375235 -0.277636 1.414999
C  1.798098 -0.370366 -0.055697
C  2.375308 -0.2175 1.215878
C  2.213573 0.339808 -1.194322
C  3.419739 0.727083 1.353594
C  3.261505 1.276613 -1.037593
C  3.855985 1.472369 0.232362
H  -4.456045 1.239477 0.638705
H  -1.524463 -0.55287 -1.995393
H  -3.764391 -1.043125 -0.633895
H  -3.858212 0.408966 -1.693509
H  -2.046665 2.590319 0.854501
H  -3.102187 2.851477 -0.553614
H  -1.487801 1.889972 -1.982104
H  -0.404007 1.595857 -0.606381
H  -3.461812 -0.758536 1.835036
H  -2.89098 0.777837 2.552502
H  -0.718656 0.617241 1.512792
H  -1.063327 -1.023663 2.165491
H  2.041853 -0.840366 2.052425
H  1.753966 0.140925 -2.168147
H  3.896364 0.870096 2.3291
H  3.617662 1.841901 -1.905225
H  4.669794 2.196934 0.3451
