program: Gaussian 09
title: 000138522
version: EM64L-G09RevD.01
frameworkgroup: C1[X(C19H13NO)]
method: RPBEPBE
basis: SDD
operation: Freq
keyword: #p
keyword: freq=noraman
keyword: PBEPBE/SDD
title: #p freq=noraman PBEPBE/SDD
converged: NO YES NO YES
title: Mulliken charges:
elementType: O N C C C C C C C C C C C C C C C C C C C H H H H H H H H H H H H H
charge: -0.261174 -0.326894 0.178083 0.178084 0.162936 0.162931 0.045538 0.296696 -0.312346 -0.312349 -0.356641 -0.356638 -0.338252 -0.338241 -0.241248 -0.241241 -0.262761 -0.262767 -0.214061 -0.214061 -0.234634 0.260894 0.260893 0.280901 0.280900 0.266988 0.266987 0.228720 0.228718 0.233628 0.233629 0.235642 0.235642 0.235500
chargesum: 0.00000
title: Mulliken charges with hydrogens summed into heavy atoms:
elementType: O N C C C C C C C C C C C C C C C C C C C
charge: -0.261174 -0.326894 0.178083 0.178084 0.162936 0.162931 0.045538 0.296696 -0.051452 -0.051456 -0.075741 -0.075738 -0.071264 -0.071254 -0.012528 -0.012523 -0.029133 -0.029138 0.021581 0.021582 0.000866
polarizability: 2.69368339e+02 -9.80100811e-04 2.66718650e+02 -1.30492970e-02 3.26368016e-03 1.19136142e+02
1716.lowfreq: -6.1423 -5.8509 -0.0007 -0.0006 0.0007 8.0973 38.9364 41.7572 67.0288
frequency: 38.9354 41.6127 67.0210 74.2245 116.9287 147.3783 197.7978 231.0342 242.4413 256.2589 299.0931 323.6284 381.7456 407.8331 409.2871 431.0291 432.2589 458.3092 508.2424 517.7446 550.2923 566.9524 616.6844 616.8993 633.5309 644.7835 668.8433 674.3463 703.8552 729.8460 754.2224 767.9056 769.7478 775.2071 809.4641 854.1173 877.4704 882.1573 899.2032 916.4397 920.9424 943.2785 973.0178 975.0237 982.3737 990.1356 999.9829 1001.7984 1001.8007 1023.1412 1034.2853 1042.4072 1075.2808 1099.3477 1105.1742 1171.7643 1172.4585 1173.7000 1177.0439 1178.7874 1194.1763 1232.7943 1276.1782 1284.8995 1306.7753 1309.2746 1344.6095 1374.4249 1394.2633 1400.7150 1436.4502 1441.2043 1456.9976 1469.2857 1476.6469 1485.2307 1542.6778 1562.0328 1591.1842 1592.9293 1606.0396 1612.0416 1627.2423 3132.4638 3132.4995 3132.7665 3140.4972 3146.7040 3146.8557 3151.4818 3159.5426 3162.5761 3163.1615 3171.6954 3172.3768 3173.4793
redmass: 6.1576 3.7936 5.0591 5.0495 3.8320 5.4493 5.3623 5.0372 4.8469 4.2472 6.3192 7.9171 6.7956 2.8331 3.4940 6.9184 5.7080 3.2265 3.9337 3.5914 8.2200 4.1316 6.3435 6.5079 6.5867 5.4565 3.5065 6.0505 1.7686 4.1108 6.3679 1.6102 1.2659 1.9809 2.7417 1.2481 1.4001 1.6233 3.1239 6.5429 6.1695 1.8625 1.3521 1.3658 1.3813 6.2928 1.3230 1.3404 1.3205 2.1278 2.2774 1.8545 1.5429 2.0180 2.5917 1.2763 1.0948 1.0551 1.8487 1.1053 2.1877 1.5223 1.7885 4.5929 2.9073 1.3372 2.0343 9.0231 11.5078 11.1299 2.1899 2.5450 2.4147 3.8903 2.4085 2.6699 10.2758 6.7943 8.0109 6.4683 6.2074 6.3896 6.8599 1.0859 1.0861 1.0855 1.0886 1.0897 1.0898 1.0930 1.0972 1.0950 1.0953 1.1018 1.0986 1.0985
irintensity: 1.4833 0.0000 0.1030 2.5075 0.0000 0.7021 0.0197 0.2887 0.0000 0.0001 6.2935 9.6404 5.9713 0.0000 1.5065 1.0261 3.8730 0.0000 14.4738 0.0000 2.2224 6.4175 0.7336 11.2351 4.9504 0.7314 24.7144 0.4177 49.2553 0.0000 0.0574 143.0656 0.0000 29.6148 7.0751 0.0000 0.0000 0.3094 0.5105 0.0984 20.4914 2.7687 0.0000 2.4938 0.0000 3.7566 0.0000 1.8013 0.0378 9.8260 6.3815 20.5249 11.5013 10.7301 1.6656 0.0109 0.0021 0.0021 14.8833 0.0173 0.2981 0.6005 14.1226 0.1055 56.3842 0.0102 106.1313 1.5860 0.4174 43.5948 7.5035 5.5493 111.0161 183.6348 2.1077 100.7119 159.8315 0.2578 145.5041 3.1041 5.3555 148.6626 24.7817 2.3112 5.8061 3.7271 3.5841 7.5243 0.5260 19.7485 15.3479 21.2908 14.5672 13.1603 37.7011 6.3527
temp: 298.150 k
press: 1.00000 atm
elementType: 8 7 6 6 6 6 6 6 6 6 6 6 6 6 6 6 6 6 6 6 6 1 1 1 1 1 1 1 1 1 1 1 1 1
symmnumber: 1
zpe: 689890.5 jmol-1
zpe.correction: 0.262765 hartree
zpe.thermalcorrener: 0.278213 hartree
zpe.thermalcorrenthalpy: 0.279157 hartree
zpe.thermalcorrgfe: 0.219362 hartree
zpe.sumelectzpe: -860.419322 hartree
zpe.sumelectthermal: -860.403874 hartree
zpe.sumelectthermalent: -860.402930 hartree
zpe.sumelectthermalfe: -860.462725 hartree
dipole: -6.7279 -0.0001 0.0007
dipole: 6.7279
quadrupole: -121.9535 -107.3202 -119.3705
quadrupole: -0.0006 -0.0002 -0.0018
quadrupole: -5.7387 8.8945 -3.1558 -0.0006 -0.0002 -0.0018
hfenergy: -860.6820874 hartree
pointgroup: C01 [X(C19H13N1O1)]
dipole: 2.6469745 0.0018562 0.0002864 debye
polarizability: 269.3683393|0.0008348|266.7186502|0.0130515|-0.0032547|119.1361416 unknown
InChI: InChI=1S/C19H13NO/c21-19-15-10-4-6-12-17(15)20(14-8-2-1-3-9-14)18-13-7-5-11-16(18)19/h1-13H
charge 0 multiplicity 1
34 atoms
O  -3.887346 -0.00279 -0.000161
N  0.305828 0.000191 0.000057
C  -0.385054 -1.232729 0.000106
C  -0.386796 1.232126 -0.000128
C  -1.817479 -1.254342 0.000024
C  -1.819256 1.251706 -0.000196
C  -2.609046 -0.001879 -0.000094
C  1.761112 0.001212 0.000296
C  0.329967 -2.466707 0.000329
C  0.326466 2.46712 -0.000201
C  -2.494965 -2.503284 0.000091
C  -2.498518 2.499681 -0.000353
C  2.462705 0.001193 -1.226858
C  2.462287 0.002219 1.227691
C  -0.367339 -3.685239 0.000397
C  -0.372578 3.684653 -0.000376
C  -1.788611 -3.714389 0.000262
C  -1.793893 3.71179 -0.000443
C  3.876044 0.002164 -1.224343
C  3.875623 0.003198 1.225659
C  4.583944 0.00317 0.000778
H  1.422955 -2.465174 0.000469
H  1.419456 2.467152 -0.000127
H  -3.589806 -2.469675 0.000032
H  -3.593312 2.464515 -0.00039
H  1.900506 0.000406 -2.166753
H  1.899767 0.002214 2.167395
H  0.199455 -4.623265 0.000573
H  0.192881 4.623485 -0.000451
H  -2.321916 -4.670299 0.000301
H  -2.328553 4.666943 -0.000554
H  4.42082 0.002139 -2.174573
H  4.42008 0.003972 2.176071
H  5.679372 0.003922 0.000968
