program: Gaussian 09
title: 000138521
version: EM64L-G09RevD.01
frameworkgroup: C1[X(C11H9BrO)]
method: RPBEPBE
basis: SDD
operation: Freq
keyword: #p
keyword: freq=noraman
keyword: PBEPBE/SDD
title: #p freq=noraman PBEPBE/SDD
converged: NO NO NO NO
title: Mulliken charges:
elementType: Br O C C C C C C C C C C C H H H H H H H H H
charge: -0.005903 -0.267841 0.189447 0.558986 0.189650 -0.457074 -0.376315 -0.399074 -0.397337 -0.197333 -0.234708 -0.243295 -0.533312 0.275161 0.251474 0.246637 0.244125 0.230877 0.230931 0.224257 0.246389 0.224257
chargesum: 0.00000
title: Mulliken charges with hydrogens summed into heavy atoms:
elementType: Br O C C C C C C C C C C C
charge: -0.005903 -0.267841 0.189447 0.558986 0.189650 -0.457074 -0.101154 -0.147600 -0.150700 0.046792 -0.003830 -0.012364 0.161591
polarizability: 1.90176183e+02 -3.10142835e+00 1.76720748e+02 -5.13475454e-04 -3.93028513e-04 5.58845021e+01
1716.lowfreq: -4.0384 -3.5023 -0.0009 0.0006 0.0007 6.9924 73.3564 100.1007 137.6753
frequency: 73.3542 100.1004 137.6740 160.2570 185.2377 195.9196 238.5885 263.9856 339.9486 346.3552 418.3809 461.5594 467.9104 505.2817 561.4639 590.0214 608.4440 639.9419 696.4289 780.5927 781.3915 787.1101 812.4855 876.6901 891.4420 922.2729 961.5117 976.8029 999.7823 1029.3005 1075.7749 1117.7194 1122.1928 1152.4347 1166.7561 1177.1482 1204.7351 1239.2961 1268.1999 1360.5820 1368.7300 1411.2862 1429.2808 1438.2762 1452.5680 1468.6888 1475.5014 1512.3343 1576.5822 1585.8850 1627.9389 2958.7162 3045.5262 3124.9842 3131.5143 3147.7707 3155.3642 3163.5140 3174.1330 3175.9398
redmass: 4.1924 3.8927 3.8248 7.1101 4.4498 4.5215 1.1449 9.8559 4.6810 4.1564 3.1719 6.0305 3.3435 6.4236 6.0384 3.4389 6.1420 3.3087 5.6744 1.3626 5.4370 2.5451 1.5705 6.0727 1.6421 1.3714 7.4462 1.3664 1.3275 2.4640 3.4769 1.2602 1.9961 1.5176 1.4891 1.1366 1.5875 2.3782 1.7423 4.5278 1.9274 6.4176 2.5882 1.5478 1.7913 1.0487 1.0752 3.8463 7.7067 6.1108 6.8904 1.0333 1.1038 1.0994 1.0858 1.0900 1.0883 1.0958 1.0960 1.0977
irintensity: 1.4502 4.2837 5.0926 0.1460 4.7551 1.0021 0.0503 0.2244 1.9996 1.0582 7.4721 0.7846 0.2485 9.9317 2.9291 0.9059 29.4577 1.5320 5.8343 92.7112 1.8949 6.8564 51.2287 34.1440 0.6383 0.1269 13.9442 2.9784 0.0342 17.5407 93.9739 0.1127 6.2440 2.9293 4.8384 0.5893 33.5054 127.0310 51.4593 1.9749 114.2689 9.4743 14.6165 11.6003 43.1601 14.3473 23.9440 13.4118 15.5234 51.9548 2.5873 71.7396 45.2702 20.5812 5.6638 10.7392 6.8823 14.5115 13.4339 11.0108
temp: 298.150 k
press: 1.00000 atm
elementType: 35 8 6 6 6 6 6 6 6 6 6 6 6 1 1 1 1 1 1 1 1 1
symmnumber: 1
zpe: 437352.4 jmol-1
zpe.correction: 0.166579 hartree
zpe.thermalcorrener: 0.177740 hartree
zpe.thermalcorrenthalpy: 0.178685 hartree
zpe.thermalcorrgfe: 0.128624 hartree
zpe.sumelectzpe: -512.335237 hartree
zpe.sumelectthermal: -512.324075 hartree
zpe.sumelectthermalent: -512.323131 hartree
zpe.sumelectthermalfe: -512.373191 hartree
dipole: 2.9608 -1.2731 0.0000
dipole: 3.2229
quadrupole: -75.6384 -69.8929 -90.3099
quadrupole: -8.6210 0.0001 -0.0001
quadrupole: 2.9753 8.7209 -11.6962 -8.6210 0.0001 -0.0001
hfenergy: -512.5018152 hartree
pointgroup: C01 [X(C11H9Br1O1)]
dipole: -1.2072644 0.3877188 -0.0000066 debye
dipolederiv: -0.3853259 0.3622805 0.0000018 0.298654 -0.4083658 -0.0000018 0.0000016 -0.0000018 -0.0425061 -1.607504 0.4128069 0.0000014 0.7088848 -0.569264 -0.0000007 0.0000032 -0.0000044 -0.2815512 -0.2115115 0.1469353 0.0000011 0.0403998 0.0138646 0.0000007 0. 0.0000014 0.0110678 -0.1468145 0.3548474 0.0000014 0.2226379 -0.0191534 -0.0000009 0.0000007 -0.0000012 0.0861506 1.0678783 -0.4216894 -0.0000038 -0.9619782 0.5205771 0.0000011 -0.0000105 0.000005 0.0783187 0.4646087 -0.7933363 -0.000004 -0.5978182 0.5691371 0.0000036 -0.0000027 0.0000036 -0.1820927 -0.0172165 -0.0861558 -0.0000015 0.0439106 -0.0523558 0.0000009 -0.0000014 0.0000018 -0.1406684 -0.0026176 -0.0572518 -0.0000006 -0.1271698 -0.0856092 0.0000005 0. -0.0000002 -0.1573567 -0.1231247 -0.0720872 -0.0000005 0.3714581 -0.2319068 -0.0000001 0.000004 -0.0000021 -0.2236291 0.0221998 0.1671384 0.0000009 -0.000597 -0.0782034 0. -0.0000001 0.0000003 -0.077607 -0.1075047 0.0458629 0. -0.0597916 0.1320879 0.0000022 -0.0000004 0.0000017 -0.1672065 0.1685483 -0.0091536 -0.0000012 0.0456009 -0.0144933 0.0000007 -0.0000013 0.0000006 -0.1503117 0.9539238 -0.1182601 -0.0000006 0.2033395 0.1848011 -0.0000015 0.0000037 -0.0000025 0.322421 0.0419499 0.0872994 0.0000013 0.0600828 0.0340435 -0.000001 0.0000014 -0.0000019 0.1600898 0.0020329 0.0424233 0.0000005 0.0935824 0.0612496 -0.0000007 0.0000005 0. 0.1581795 -0.0968216 -0.0377597 -0.0000001 -0.0485143 0.0683941 -0.0000005 0. -0.0000005 0.1752872 0.0959347 -0.0223432 -0.0000002 -0.0161649 -0.0642151 -0.000001 -0.0000007 -0.000001 0.1570006 0.0809689 -0.0332754 0. -0.0392525 -0.1342172 -0.0000019 0.0000002 -0.0000017 0.160564 -0.101708 -0.0868466 0.0000003 -0.0718651 0.0526024 -0.0000005 0.0000004 -0.0000004 0.1590295 -0.0325562 0.0191902 -0.0010659 -0.158288 0.0309637 -0.1213125 -0.066906 -0.0838255 -0.0848853 -0.0327797 0.080187 -0.0000012 0.1511806 -0.0409011 0.0000022 -0.0000015 0.0000018 0.1245915 -0.0325604 0.0191879 0.0010706 -0.1582917 0.0309642 0.121311 0.0669088 0.0838267 -0.0848856 unknown
polarizability: 187.4402592|-6.2407228|179.4566718|-0.0001289|0.0006337|55.8845021 unknown
InChI: InChI=1S/C11H9BrO/c1-13-11-7-6-10(12)8-4-2-3-5-9(8)11/h2-7H,1H3
charge 0 multiplicity 1
22 atoms
Br 2.21592 -3.053083 -0.00001
O  -2.477481 0.992207 0.000016
C  -0.118031 0.57288 0.000011
C  1.015104 -0.336184 0.000004
C  -1.458674 0.034102 0.000008
C  0.739015 -1.748499 -0.000003
C  0.114234 1.984908 0.000019
C  2.334842 0.223158 0.000002
C  -1.675094 -1.348342 0.0000
C  -0.561426 -2.24227 -0.000004
C  1.414106 2.496424 0.00002
C  2.531884 1.606127 0.00001
C  -3.859184 0.516335 -0.000003
H  -0.753489 2.650344 0.000028
H  3.19284 -0.456216 -0.000003
H  -2.684723 -1.767728 -0.000002
H  -0.740771 -3.321232 -0.000009
H  1.577818 3.579542 0.000027
H  3.550386 2.00975 0.000009
H  -4.077261 -0.08523 -0.904366
H  -4.480031 1.424333 -0.000013
H  -4.077285 -0.085226 0.904359
