program: Gaussian 09
title: 000138520
version: EM64L-G09RevD.01
frameworkgroup: C1[X(C16H12O3)]
method: RPBEPBE
basis: SDD
operation: Freq
keyword: #pfreq=noraman
keyword: PBEPBE/SDD
title: #p freq=noraman PBEPBE/SDD
converged: YES YES NO YES
title: Mulliken charges:
elementType: O O O C C C C C C C C C C C C C C C C H H H H H H H H H H H H
charge: -0.202176 -0.138748 -0.138784 -0.428021 -0.427878 0.530115 0.529924 0.160459 0.160438 -0.403526 -0.403418 -0.384366 -0.384398 -0.231925 -0.231949 -0.233614 -0.233615 -0.238424 -0.238425 0.295883 0.295890 0.236630 0.236642 0.237769 0.237806 0.232957 0.232956 0.231581 0.231580 0.234320 0.234317
chargesum: 0.00000
title: Mulliken charges with hydrogens summed into heavy atoms:
elementType: O O O C C C C C C C C C C C C C C C C
charge: -0.202176 -0.138748 -0.138784 -0.132138 -0.131989 0.530115 0.529924 0.160459 0.160438 -0.166896 -0.166776 -0.146597 -0.146592 0.001032 0.001006 -0.002032 -0.002035 -0.004104 -0.004108
polarizability: 2.01346267e+02 2.28991079e-02 1.83403630e+02 2.05608843e+01 -1.37143563e-02 1.17925531e+02
1716.lowfreq: -6.3221 0.0007 0.0010 0.0011 3.5146 8.0811 22.5897 23.5236 33.1446
frequency: 22.1035 23.5140 33.1061 59.8714 84.5080 125.6565 132.1029 173.3113 223.9419 251.3482 283.8218 290.4656 400.0436 400.1966 409.7441 416.5259 475.3491 494.0534 543.1945 579.6258 594.6312 616.5605 618.2564 624.7351 652.3738 700.4139 701.7133 711.7814 761.1169 768.1172 816.7428 836.1571 845.3953 848.8778 850.1107 863.1108 918.3499 921.3198 975.2923 975.7158 989.4921 991.5067 998.7340 999.1104 1009.2752 1024.6419 1033.1678 1039.5502 1086.1657 1087.3111 1098.5288 1175.7460 1175.7872 1185.2869 1195.0073 1195.4492 1200.2784 1204.0661 1244.6024 1281.5590 1285.8378 1337.8026 1338.7628 1382.4785 1384.0360 1443.5719 1443.6757 1486.8534 1488.2170 1594.3547 1594.5877 1616.0570 1616.2020 1701.3037 1769.0924 2981.4076 2994.2596 3123.6053 3123.7496 3124.3284 3124.4807 3138.5475 3138.6413 3150.7775 3150.8744 3167.5783 3167.6901
redmass: 3.8239 5.4648 4.3651 7.1196 5.4342 9.3940 10.2792 5.2015 4.5378 5.7228 5.2187 7.6563 2.7799 2.7762 6.2122 9.3639 4.1710 3.9733 4.6355 13.1576 5.1780 6.4585 6.4065 4.2049 6.7513 1.8537 1.7461 5.7737 1.8724 2.1170 7.3038 4.5787 7.5134 1.3215 1.2815 3.4872 1.4837 1.4572 1.4048 1.4125 5.6723 5.9345 1.3344 1.3257 4.5096 3.0425 2.1176 3.2199 1.6307 1.7006 7.1098 1.0572 1.0565 1.2919 1.1193 1.1182 1.6129 1.6720 1.2601 2.0322 2.2710 1.2737 1.3137 7.9493 7.8034 2.1826 2.1862 2.3039 2.3266 6.0509 6.0286 6.0507 6.0802 13.0725 13.0169 1.0813 1.0825 1.0866 1.0868 1.0883 1.0883 1.0912 1.0913 1.0960 1.0959 1.1015 1.1015
irintensity: 0.0720 0.0122 0.0324 0.3971 0.3772 1.3277 4.8347 0.7126 0.5757 7.2646 0.5565 3.8287 0.0842 0.2350 5.3730 7.2658 1.0465 25.9403 3.2245 2.3139 14.7743 0.0105 0.7226 45.4840 3.2859 73.6048 11.7565 9.2087 10.6263 71.2588 235.5713 168.6953 4.1345 15.2477 0.1101 3.0035 0.4397 20.0888 0.2104 0.1070 9.4862 1.6913 0.0007 0.0126 43.2487 0.2659 24.8301 3.3591 14.2147 1.4847 206.9435 0.0510 0.2223 14.6212 0.3288 0.0396 3.2998 0.4704 13.5426 1.8850 2.1343 0.3293 0.7647 0.4934 0.0537 5.1326 12.0800 13.9142 17.9005 0.9490 2.0873 2.5697 2.8681 493.7558 106.6537 6.2163 6.1401 3.0971 12.5707 0.9341 3.2941 8.4722 13.7630 35.1799 22.9511 21.2396 15.2053
temp: 298.150 k
press: 1.00000 atm
elementType: 8 8 8 6 6 6 6 6 6 6 6 6 6 6 6 6 6 6 6 1 1 1 1 1 1 1 1 1 1 1 1
symmnumber: 1
zpe: 616718.6 jmol-1
zpe.correction: 0.234896 hartree
zpe.thermalcorrener: 0.250294 hartree
zpe.thermalcorrenthalpy: 0.251238 hartree
zpe.thermalcorrgfe: 0.189368 hartree
zpe.sumelectzpe: -841.267201 hartree
zpe.sumelectthermal: -841.251803 hartree
zpe.sumelectthermalent: -841.250859 hartree
zpe.sumelectthermalfe: -841.312729 hartree
dipole: -0.0009 -6.0215 -0.0001
dipole: 6.0215
quadrupole: -107.6080 -119.8788 -107.3343
quadrupole: 0.0049 13.9724 -0.0053
quadrupole: 3.9991 -8.2718 4.2727 0.0049 13.9724 -0.0053
hfenergy: -841.5020967 hartree
pointgroup: C01 [X(C16H12O3)]
dipole: 0.0014351 2.3690296 0.0001989 debye
polarizability: 201.1549805|-0.0350503|183.4036748|-20.9443831|0.0064733|118.1167731 unknown
InChI: InChI=1S/C16H12O3/c17-15-13(11-7-3-1-4-8-11)14(16(18)19-15)12-9-5-2-6-10-12/h1-10,13-14H
charge 0 multiplicity 1
31 atoms
O  -0.001879 -3.10288 -0.000446
O  -2.049211 -2.778169 -1.067667
O  2.045875 -2.781273 1.066896
C  -0.578388 -0.808564 -0.531882
C  0.577793 -0.809502 0.531554
C  -1.683062 0.202465 -0.26725
C  1.683786 0.200177 0.267216
C  -1.032453 -2.274404 -0.591673
C  1.029846 -2.275969 0.590968
C  -1.638023 1.467594 -0.903096
C  1.639402 1.465773 0.902208
C  -2.728642 -0.070364 0.651439
C  2.729891 -0.074233 -0.650399
C  -2.618651 2.446037 -0.627344
C  2.621168 2.443115 0.626635
C  -3.709407 0.906629 0.927336
C  3.711802 0.901672 -0.926105
C  -3.657268 2.168483 0.290192
C  3.6603 2.163994 -0.289848
H  -0.124528 -0.594183 -1.521005
H  0.124199 -0.594792 1.520733
H  -0.832213 1.689489 -1.613301
H  0.833202 1.688891 1.611589
H  -2.795569 -1.051913 1.13618
H  2.796338 -1.056171 -1.134398
H  -2.573612 3.418668 -1.129217
H  2.576614 3.416117 1.127833
H  -4.518391 0.681717 1.630931
H  4.52117 0.675531 -1.628864
H  -4.422086 2.923652 0.50209
H  4.425995 2.918315 -0.501603
