program: Gaussian 09
title: 000138518
version: EM64L-G09RevD.01
frameworkgroup: C1[X(C9H12N2O4)]
method: RPBEPBE
basis: SDD
operation: Freq
keyword: #p
keyword: freq=noraman
keyword: PBEPBE/SDD
title: #p freq=noraman PBEPBE/SDD
converged: YES YES NO YES
title: Mulliken charges:
elementType: O O O O N N C C C C C C C C C H H H H H H H H H H H H
charge: -0.322333 -0.239359 -0.215897 -0.231748 -0.435962 0.038411 0.229510 0.066938 0.035098 0.312821 -0.786089 -0.758411 0.184162 -0.210661 -0.675914 0.351397 0.267284 0.249963 0.249978 0.209089 0.270950 0.270937 0.232615 0.232614 0.219435 0.227585 0.227586
chargesum: 0.00000
title: Mulliken charges with hydrogens summed into heavy atoms:
elementType: O O O O N N C C C C C C C C C
charge: -0.322333 -0.239359 -0.215897 -0.231748 -0.084564 0.038411 0.229510 0.066938 0.035098 0.312821 -0.018863 -0.007436 0.184162 0.254568 -0.001308
polarizability: 1.98579767e+02 2.57834069e+00 1.47196882e+02 -7.26736228e-03 3.35606469e-03 6.92680654e+01
1716.lowfreq: -8.0196 -7.4683 -3.8396 -0.0006 -0.0006 0.0002 40.7496 55.1265 63.6285
frequency: 40.2376 55.1240 63.5410 82.4040 91.2633 121.1200 141.2309 146.1198 166.5812 185.9297 230.7262 248.0792 265.3584 267.0650 294.7713 338.9787 342.5520 365.6794 447.8160 478.2989 579.8883 614.7695 615.7719 624.7668 713.4541 720.8428 731.4994 737.3207 753.0275 800.3748 811.4302 857.2976 987.0513 1008.1550 1036.7560 1036.7674 1043.1453 1061.4552 1111.4619 1115.6337 1137.7223 1172.4830 1237.7950 1250.9112 1270.4203 1320.2190 1344.2450 1361.9996 1403.1488 1406.5892 1410.2529 1431.1644 1441.5545 1441.6619 1456.8735 1466.2284 1467.4870 1475.2749 1481.2090 1487.6088 1524.6921 1578.1586 1641.0486 2994.4741 2995.8332 2998.3247 3013.1324 3070.9639 3072.2605 3083.0719 3092.6406 3095.1409 3106.3966 3123.5212 3575.4497
redmass: 3.6712 7.5402 2.4761 4.2118 7.2027 3.0151 1.0621 1.0372 2.9413 6.8024 3.8557 1.3631 3.1285 4.1940 4.5987 7.3885 4.2839 3.9437 6.4701 6.3792 4.2188 4.3285 5.7705 6.4186 1.2886 4.7846 8.0093 7.4145 10.4767 1.1015 4.3102 3.5241 1.6608 2.3447 3.4382 1.4688 1.5073 2.3811 2.3317 5.3829 1.4661 5.0431 1.6222 1.1300 9.8377 5.2897 5.6472 1.5136 1.2689 1.2156 1.3140 2.7276 3.1882 1.0434 1.3092 1.0403 1.0458 1.0591 1.4583 1.0795 5.2566 5.9963 10.3387 1.0368 1.0359 1.0377 1.0583 1.1064 1.0957 1.0966 1.0984 1.1008 1.1031 1.1007 1.0811
irintensity: 0.3001 0.5522 0.0363 0.3027 1.0016 9.8973 0.1993 0.1307 0.0462 6.4991 0.9939 0.0881 0.5567 2.9308 10.7514 3.3747 0.0005 6.9420 2.6302 0.4165 5.2181 1.3422 1.1948 2.3408 72.3376 16.4181 8.5341 4.4088 30.9883 4.0084 12.8608 10.6745 31.6123 100.1003 329.5871 4.6216 8.1244 40.6085 3.4332 4.1526 5.5998 194.9772 279.0027 0.0093 164.4657 151.3509 55.2291 2.8199 32.7177 30.5827 27.2803 186.8244 13.1036 15.0292 8.8859 13.1205 14.3141 5.9957 3.9830 12.2508 29.2332 124.8713 315.5065 12.4812 22.2082 4.8512 20.3145 4.4761 8.4052 3.3688 30.4237 17.7409 47.0442 3.4094 105.5614
temp: 298.150 k
press: 1.00000 atm
elementType: 8 8 8 8 7 7 6 6 6 6 6 6 6 6 6 1 1 1 1 1 1 1 1 1 1 1 1
symmnumber: 1
zpe: 542887.5 jmol-1
zpe.correction: 0.206775 hartree
zpe.thermalcorrener: 0.222551 hartree
zpe.thermalcorrenthalpy: 0.223495 hartree
zpe.thermalcorrgfe: 0.162884 hartree
zpe.sumelectzpe: -759.366773 hartree
zpe.sumelectthermal: -759.350998 hartree
zpe.sumelectthermalent: -759.350053 hartree
zpe.sumelectthermalfe: -759.410664 hartree
dipole: -5.8945 4.3043 0.0002
dipole: 7.2988
quadrupole: -99.5900 -85.2615 -86.4057
quadrupole: -3.3588 -0.0010 0.0000
quadrupole: -9.1709 5.1576 4.0134 -3.3588 -0.0010 0.0000
hfenergy: -759.5735483 hartree
pointgroup: C01 [X(C9H12N2O4)]
dipole: 2.2931941 1.7283329 -0.0000811 debye
polarizability: 198.645985|-1.8002712|147.1306644|-0.0072158|-0.0034656|69.2680654 unknown
InChI: InChI=1S/C9H12N2O4/c1-4-15-9(12)7-5(2)8(11(13)14)6(3)10-7/h10H,4H2,1-3H3
charge 0 multiplicity 1
27 atoms
O  2.77257 0.336278 -0.000378
O  2.270349 -1.957433 -0.000258
O  -3.610251 -1.356461 0.00004
O  -3.928007 0.906908 -0.000153
N  0.230042 1.107014 -0.000242
N  -3.156451 -0.141982 0.000052
C  -0.722132 -0.97112 -0.00011
C  0.504105 -0.277463 -0.000164
C  -1.73321 0.061121 -0.000065
C  -1.119005 1.347867 -0.000136
C  -0.90522 -2.462136 -0.000072
C  -1.694083 2.729827 -0.000118
C  1.881397 -0.763297 -0.000216
C  4.22579 -0.008455 -0.000531
C  4.996661 1.307387 -0.000629
H  0.973621 1.806909 -0.000326
H  0.071659 -2.968426 -0.000461
H  -1.489327 -2.785133 0.879842
H  -1.490087 -2.785098 -0.879483
H  -0.894873 3.491963 -0.000235
H  -2.342539 2.885862 -0.879338
H  -2.34234 2.885928 0.87924
H  4.435233 -0.622053 0.894054
H  4.435039 -0.62207 -0.895149
H  6.082399 1.101466 -0.000745
H  4.760284 1.906139 -0.897125
H  4.760478 1.906157 0.895906
