program: Gaussian 09
title: 000138516
version: EM64L-G09RevD.01
frameworkgroup: C1[X(C16H17NO)]
method: RPBEPBE
basis: SDD
operation: Freq
keyword: #p
keyword: freq=noraman
keyword: PBEPBE/SDD
title: #p freq=noraman PBEPBE/SDD
converged: YES YES NO NO
title: Mulliken charges:
elementType: O N C C C C C C C C C C C C C C C C H H H H H H H H H H H H H H H H H
charge: -0.296017 -0.354977 -0.526578 -0.403933 0.485135 -0.634114 0.242555 0.398459 -0.408509 -0.395435 -0.360489 -0.413316 -0.232549 -0.258266 -0.247325 -0.227146 -0.222331 -0.243059 0.231426 0.208618 0.224595 0.253335 0.250071 0.243282 0.324024 0.226712 0.271585 0.254743 0.236884 0.224030 0.230976 0.227731 0.231481 0.228299 0.230105
chargesum: 0.00000
title: Mulliken charges with hydrogens summed into heavy atoms:
elementType: O N C C C C C C C C C C C C C C C C
charge: -0.296017 -0.030953 -0.086534 0.073997 0.485135 -0.140761 0.242555 0.398459 -0.181796 -0.123849 -0.105746 -0.176432 -0.008519 -0.027290 -0.019594 0.004335 0.005968 -0.012955
polarizability: 1.66349113e+02 -6.86482170e+00 1.86571039e+02 -2.45498088e+01 -1.03415752e+01 1.51771738e+02
1716.lowfreq: -13.1225 -9.6483 -6.0714 -2.9451 -0.0010 -0.0009 -0.0005 18.2659 22.3443
frequency: -6.5350 17.2063 22.2107 46.9014 58.5997 61.8371 125.5968 154.4317 213.5792 226.9974 291.3733 303.2123 317.5120 361.1727 402.6493 405.0864 453.2948 464.8109 473.0839 547.1877 573.2955 594.0217 615.6302 617.2120 627.5360 632.5492 704.5164 705.7795 736.6985 751.6960 759.7705 818.5161 856.4272 858.3549 861.2135 889.7818 914.2680 927.9694 937.5483 964.2478 978.9475 979.8354 989.5491 990.4039 997.2155 998.0012 1026.5164 1030.2593 1047.0652 1081.8851 1094.1763 1103.5673 1171.9940 1172.3596 1178.2830 1190.2232 1196.4593 1200.5554 1208.1568 1213.0238 1236.2102 1249.7727 1289.4005 1318.9868 1329.2270 1354.2155 1361.1031 1379.3425 1383.0648 1437.5498 1438.1370 1449.1698 1456.0857 1481.2196 1483.6210 1491.2602 1498.3303 1589.0987 1592.1160 1606.5350 1614.3904 1616.6130 2959.3864 2989.4827 3006.0303 3008.5986 3060.2515 3070.6068 3109.2902 3119.3967 3121.1162 3123.5764 3134.3710 3134.9390 3144.9460 3146.9266 3161.2011 3164.3438 3523.2039
redmass: 4.4947 4.1184 4.0109 4.0073 4.1523 7.7616 4.2519 4.4289 3.5906 3.5949 2.7953 2.5921 2.4195 5.9230 2.8098 2.8473 3.6484 3.1533 3.2545 3.3825 2.9002 4.2762 5.2885 6.2597 1.4695 2.8609 2.2132 1.8564 1.4092 3.5821 1.9467 3.4736 1.2543 1.3016 2.0702 2.2225 1.6294 1.7705 1.7014 2.4559 1.3967 1.4446 5.8922 4.2845 1.3127 1.3811 2.2035 2.1844 2.1321 1.6036 2.4782 2.1767 1.0744 1.0548 1.1346 1.1358 1.2428 1.3984 1.9551 1.9063 1.4551 1.6815 1.5707 1.4758 1.2727 1.3272 1.4338 7.9380 4.9357 1.9123 1.9845 1.1881 1.1629 1.2167 2.2730 1.9331 1.7857 5.9968 5.8138 6.8772 6.1112 6.0926 1.0610 1.0669 1.0608 1.0991 1.0998 1.0953 1.0871 1.0864 1.0879 1.0862 1.0916 1.0913 1.0960 1.0959 1.1015 1.1015 1.0771
irintensity: 0.1152 0.1133 0.0136 2.4004 0.2136 10.4581 1.9423 0.9630 0.2617 5.9484 2.5062 3.3182 1.1774 13.5064 0.0388 0.2357 0.9112 4.3353 25.6194 8.4539 16.4615 4.2931 4.7653 2.1980 70.8619 13.6128 61.7290 22.9846 80.8549 6.2996 24.7550 1.8875 0.1602 1.1470 6.0468 4.4427 2.5498 7.0919 8.4418 1.2552 0.2305 0.4854 0.0399 0.0511 0.2967 1.1829 5.7061 5.7396 14.4998 11.2752 5.0671 2.7405 1.0404 0.0361 4.7196 1.7265 1.7616 5.4322 0.6289 5.5796 73.6378 29.1790 1.9564 5.7349 0.4982 1.0273 1.6282 0.1597 0.8246 8.0703 1.8534 53.7590 18.6717 46.0550 13.8283 14.1613 143.8795 9.0878 5.4028 195.4413 17.2178 34.9539 18.3259 76.0918 12.7245 22.3629 4.0445 12.2635 9.6056 5.7598 2.4389 1.0639 17.2867 9.9131 23.9130 36.1845 26.0299 19.5774 33.6433
temp: 298.150 k
press: 1.00000 atm
elementType: 8 7 6 6 6 6 6 6 6 6 6 6 6 6 6 6 6 6 1 1 1 1 1 1 1 1 1 1 1 1 1 1 1 1 1
symmnumber: 1
zpe: 758285.1 jmol-1
zpe.correction: 0.288816 hartree
zpe.thermalcorrener: 0.304093 hartree
zpe.thermalcorrenthalpy: 0.305037 hartree
zpe.thermalcorrgfe: 0.243490 hartree
zpe.sumelectzpe: -748.606115 hartree
zpe.sumelectthermal: -748.590838 hartree
zpe.sumelectthermalent: -748.589894 hartree
zpe.sumelectthermalfe: -748.651441 hartree
dipole: -1.5377 -2.7101 2.6345
dipole: 4.0804
quadrupole: -101.8016 -109.4884 -101.6129
quadrupole: -3.7561 -2.8440 4.7858
quadrupole: 2.4994 -5.1875 2.6881 -3.7561 -2.8440 4.7858
hfenergy: -748.8949309 hartree
pointgroup: C01 [X(C16H17N1O1)]
dipole: 0.4847883 0.9354947 1.2111847 debye
polarizability: 144.8462691|2.4167672|188.8748242|23.7909887|0.2413802|170.9707965 unknown
InChI: InChI=1S/C16H17NO/c18-16(13-15-9-5-2-6-10-15)17-12-11-14-7-3-1-4-8-14/h1-10,17H,11-13H2
charge 0 multiplicity 1
35 atoms
O  -0.729412 -2.944708 -1.068764
N  -0.53991 -1.596148 0.821536
C  -2.567075 -0.148168 1.178395
C  -1.978103 -1.577206 1.124923
C  -2.429912 0.687416 -0.093816
C  1.508844 -2.128147 -0.485247
C  -0.018045 -2.253399 -0.274424
C  2.223128 -1.050573 0.313936
C  -2.423563 2.10354 0.00685
C  -2.347228 0.103578 -1.384718
C  2.013346 0.324041 0.015648
C  3.107614 -1.386005 1.371418
C  -2.348726 2.918519 -1.144648
C  -2.269852 0.916859 -2.539006
C  -2.272504 2.325981 -2.426686
C  2.672451 1.332086 0.753079
C  3.769543 -0.378833 2.111824
C  3.554023 0.98416 1.804438
H  -3.642651 -0.253046 1.433868
H  -2.112421 0.405378 2.024881
H  -2.164089 -2.074718 2.097521
H  -2.466878 -2.189758 0.347966
H  1.636893 -1.967547 -1.571326
H  1.936396 -3.125389 -0.269738
H  0.090745 -1.015984 1.380477
H  -2.479445 2.572227 0.998209
H  -2.327594 -0.986095 -1.500969
H  1.330038 0.601288 -0.796871
H  3.28269 -2.442042 1.611656
H  -2.348283 4.009934 -1.042329
H  -2.204494 0.445473 -3.526316
H  -2.213665 2.953142 -3.323451
H  2.501129 2.385891 0.506423
H  4.45289 -0.657574 2.921904
H  4.068319 1.766029 2.374356
