program: Gaussian 09
title: 000138513
version: EM64L-G09RevD.01
frameworkgroup: C1[X(C8H14)]
method: RPBEPBE
basis: SDD
operation: Freq
keyword: #p
keyword: freq=noraman
keyword: PBEPBE/SDD
title: #p freq=noraman PBEPBE/SDD
converged: YES YES NO NO
title: Mulliken charges:
elementType: C C C C C C C C H H H H H H H H H H H H H H
charge: -0.276413 -0.505677 -0.504757 0.570533 -0.537849 -0.383206 -0.774287 -0.674778 0.242788 0.239213 0.236677 0.228230 0.230541 0.202307 0.209177 0.201961 0.206197 0.220336 0.221916 0.206338 0.210804 0.229950
chargesum: 0.00000
title: Mulliken charges with hydrogens summed into heavy atoms:
elementType: C C C C C C C C
charge: -0.033625 -0.029787 -0.045985 0.570533 -0.126365 0.024952 -0.332036 -0.027686
polarizability: 9.10810839e+01 -3.39730506e-01 9.07134322e+01 -3.14380094e+00 -2.16138479e+00 7.03597231e+01
1716.lowfreq: -19.9308 -18.2144 0.0004 0.0005 0.0006 6.7681 24.9613 47.4001 111.5749
frequency: 20.7038 47.3057 111.5145 170.3840 202.6271 241.1621 288.8906 368.5345 415.3795 470.5534 601.9456 682.0620 716.0206 774.6069 797.8204 819.9316 851.7187 878.9838 906.6516 909.8813 939.3973 954.1821 1037.7743 1053.1948 1066.7857 1070.7514 1086.5263 1094.1252 1096.7799 1166.2616 1194.1034 1220.8107 1244.5979 1258.5342 1314.2905 1340.8372 1383.6240 1390.1299 1427.2585 1439.6221 1457.2708 1466.6978 1474.4960 1475.1565 1486.1602 1657.6122 2961.2282 2975.2371 2981.3218 3020.4115 3035.6900 3070.2687 3077.8851 3086.6449 3090.4046 3092.7562 3105.1187 3190.8412 3192.3351 3209.8064
redmass: 2.7094 2.6369 2.4520 1.4614 2.3185 1.8559 2.2156 2.0605 2.3184 2.4588 2.5494 1.8022 1.1877 1.2824 1.1444 1.3869 2.4715 1.6518 2.4465 2.2612 1.3843 1.8226 1.1962 1.5153 1.2669 1.5622 2.2087 1.5794 1.1891 1.4012 2.3201 1.3934 1.5481 1.2855 1.2881 1.4042 1.8947 1.2499 1.2251 1.0999 1.1046 1.3221 1.0647 1.0454 1.0692 5.2894 1.0605 1.0366 1.0601 1.1000 1.1002 1.0995 1.1000 1.0801 1.0647 1.0526 1.0653 1.1159 1.1148 1.1150
irintensity: 0.0626 0.0538 0.2259 0.0799 0.5588 0.9418 0.2564 2.1537 0.4049 0.8433 13.5843 0.8061 1.3592 2.3357 4.2385 15.2566 2.3949 2.4079 11.8469 4.1334 78.9764 2.7083 25.3320 0.6066 11.2137 3.6647 2.9496 5.1842 0.7456 1.4470 2.4949 1.1388 10.7156 1.1951 0.7365 0.8403 9.7963 14.1135 4.0968 12.8804 9.7293 1.8918 2.1778 15.5542 9.8294 28.6679 26.6555 41.1009 32.5450 16.8377 46.0967 55.3615 58.5427 21.0347 3.0784 26.0257 11.6444 10.3108 16.2226 28.2620
temp: 298.150 k
press: 1.00000 atm
elementType: 6 6 6 6 6 6 6 6 1 1 1 1 1 1 1 1 1 1 1 1 1 1
symmnumber: 1
zpe: 515372.8 jmol-1
zpe.correction: 0.196295 hartree
zpe.thermalcorrener: 0.205855 hartree
zpe.thermalcorrenthalpy: 0.206799 hartree
zpe.thermalcorrgfe: 0.160519 hartree
zpe.sumelectzpe: -312.547454 hartree
zpe.sumelectthermal: -312.537895 hartree
zpe.sumelectthermalent: -312.536950 hartree
zpe.sumelectthermalfe: -312.583230 hartree
dipole: -0.0998 -0.6632 0.0771
dipole: 0.6751
quadrupole: -51.2040 -49.9975 -51.3839
quadrupole: -0.1325 -1.7692 0.9322
quadrupole: -0.3422 0.8643 -0.5221 -0.1325 -1.7692 0.9322
hfenergy: -312.7437494 hartree
pointgroup: C01 [X(C8H14)]
dipole: -0.0458855 -0.2601271 0.027751 debye
dipolederiv: -0.2204558 0.0686835 0.0006105 0.0819343 0.0379708 -0.0147857 -0.0149866 0.0366285 0.131709 0.040645 -0.0069058 -0.0339814 0.068489 -0.0193039 0.1228786 -0.0413692 0.1128572 -0.0764065 -0.116438 -0.0586453 0.079923 -0.0721533 0.012062 0.1048257 0.1218622 0.0723195 0.0051066 0.244943 -0.0290857 -0.1414233 -0.1358278 0.3317521 -0.0169155 -0.3049342 -0.0135902 -0.0671248 -0.019786 -0.0346581 -0.0013834 -0.0504116 0.0367346 0.0135256 0.0112791 -0.0226608 0.0774624 0.14648 -0.0186008 -0.0177236 -0.0043514 0.1208041 -0.0101858 0.0208934 0.0482099 0.1075511 -0.1706004 -0.0563142 -0.2320522 0.019948 -0.2704932 0.02151 -0.1638302 -0.0033133 -0.2815602 0.0130511 0.0126664 -0.0578412 0.0041664 0.0248551 0.0545244 -0.0631973 0.0535925 -0.0171068 -0.0166137 -0.0096049 -0.0663286 -0.0452683 -0.0195023 -0.0931954 -0.0513906 -0.1124419 0.0213926 0.0736337 0.0790071 -0.0146923 0.0786826 -0.1287628 0.0168364 -0.0123332 -0.0121786 0.0559676 0.11793 0.0061978 -0.006182 0.0023242 0.0414312 -0.0594131 -0.0379201 -0.0170534 -0.0960577 0.0829843 -0.0376778 0.0213194 -0.1075222 -0.0755274 -0.014814 0.0084764 -0.039396 0.0634174 0.0249623 0.0127317 0.0957597 0.0218217 0.0528552 -0.069808 0.1210995 -0.0473269 -0.0580405 -0.0592965 0.0562452 0.078098 0.0842654 -0.0713979 -0.1207988 0.0670462 -0.0546782 0.0232467 0.0061273 0.0200034 -0.0911259 0.0238827 -0.0267193 0.1221814 -0.0578927 0.1153371 -0.0645772 0.0066308 0.1340487 0.0313123 0.1203859 -0.0872505 -0.0623787 0.0154093 -0.0917413 -0.0096942 -0.1115069 -0.1180485 0.0822735 -0.0885893 -0.0021991 0.0806325 0.083151 0.0848329 -0.0438237 0.0125992 0.1074605 0.1124224 0.0858654 0.0065624 -0.0367648 0.1228902 -0.0656308 0.1109136 -0.0244747 -0.0825992 0.1272608 -0.0666767 0.0587246 0.0240834 0.1319394 0.0462755 0.111967 0.0140857 0.0924255 0.0330847 0.1329429 -0.061411 -0.0512132 0.08029 -0.0877643 0.0210372 -0.0447647 -0.0794147 -0.1243915 -0.1078084 0.0117399 -0.0896464 -0.1380556 -0.0742164 -0.0167269 -0.0001356 -0.0579148 0.1250608 -0.0460996 0.0270756 0.0789214 0.1015731 0.071939 0.0013472 unknown
polarizability: 91.2660937|-0.2638999|90.7434618|-2.4497645|-2.0282852|70.1446836 unknown
InChI: InChI=1S/C8H14/c1-3-4-7(2)8-5-6-8/h8H,2-6H2,1H3
charge 0 multiplicity 1
22 atoms
C  1.037429 -0.451858 -0.33166
C  2.170968 -1.055445 0.532115
C  2.498071 -0.107025 -0.633402
C  0.07147 0.531394 0.274433
C  -1.115698 -0.082189 1.012448
C  -2.088119 -0.892688 0.105634
C  0.245248 1.878543 0.192078
C  -2.781359 -0.029499 -0.969718
H  0.573318 -1.168083 -1.022477
H  2.399241 -2.120009 0.422953
H  2.289801 -0.661896 1.546319
H  2.859259 0.893422 -0.378919
H  2.951735 -0.532568 -1.533365
H  -1.689621 0.718166 1.518807
H  -0.73224 -0.760622 1.803081
H  -1.539928 -1.725326 -0.377926
H  -2.853858 -1.363785 0.753279
H  -0.460454 2.575197 0.660386
H  1.089019 2.321446 -0.348801
H  -3.37747 0.777018 -0.501863
H  -3.462338 -0.636969 -1.593961
H  -2.039976 0.450876 -1.633542
