program: Gaussian 09
title: 000138512
version: EM64L-G09RevD.01
frameworkgroup: C1[X(C8H8Br2O)]
method: RPBEPBE
basis: SDD
operation: Freq
keyword: #p
keyword: freq=noraman
keyword: PBEPBE/SDD
title: #p freq=noraman PBEPBE/SDD
converged: NO NO NO NO
title: Mulliken charges:
elementType: Br Br O C C C C C C C C H H H H H H H H
charge: 0.006719 0.043666 -0.249351 0.584664 -0.543235 0.500692 -0.399247 -0.415634 -0.136154 -0.817576 -0.537461 0.255012 0.270395 0.254783 0.224688 0.254801 0.225000 0.224999 0.253240
chargesum: 0.00000
title: Mulliken charges with hydrogens summed into heavy atoms:
elementType: Br Br O C C C C C C C C
charge: 0.006719 0.043666 -0.249351 0.584664 -0.288223 0.500692 -0.399247 -0.415634 0.134241 -0.083304 0.165777
polarizability: 1.83163787e+02 -7.13874534e-01 1.34916976e+02 1.54256711e-02 7.53800400e-03 5.31947106e+01
1716.lowfreq: -7.9471 -5.0915 -0.0006 -0.0005 0.0003 3.3977 60.6209 98.0023 122.8272
frequency: 60.6167 97.9998 122.8270 136.1358 146.4007 154.6136 213.4803 229.0080 249.7364 268.7265 290.6825 345.2983 399.3521 447.4094 536.1821 559.1411 609.4396 629.1963 701.3824 710.5102 851.2135 878.9844 911.9635 1000.5330 1015.6040 1032.1354 1044.5120 1115.1370 1159.5664 1180.5326 1247.7774 1257.3751 1352.2278 1363.7650 1402.2141 1442.1830 1453.6673 1462.3376 1471.4813 1472.6387 1478.4398 1565.3595 1586.8005 2960.1911 2982.4693 3048.5683 3062.9406 3089.9254 3128.3568 3153.5299 3173.7060
redmass: 3.9345 4.4793 21.1778 2.9240 1.2243 5.2337 1.6467 4.4005 5.5750 1.6852 8.6496 6.6390 3.5343 2.9858 5.5143 4.9029 5.5287 6.6750 6.2496 3.1359 1.5356 1.3813 4.9829 1.8320 4.6310 3.9123 1.5204 1.2587 1.3661 1.8261 3.0558 1.6058 4.7642 8.4925 1.2310 1.3038 2.0044 1.0444 1.0493 1.1000 1.2153 9.1750 6.1512 1.0334 1.0369 1.1040 1.0974 1.0997 1.0991 1.0901 1.0931
irintensity: 0.4585 6.9231 0.1466 0.6987 0.6408 2.7949 0.0116 1.0907 1.8416 0.0477 0.5331 2.1761 1.6146 11.6843 3.1658 5.1345 0.0861 61.8973 2.4431 2.2320 19.2912 21.8377 16.4964 23.9775 1.5973 99.2335 11.4469 0.1599 4.2795 65.4179 89.5267 1.5657 97.5195 10.4615 21.0705 29.8945 114.5210 14.7349 12.9847 80.1326 26.0418 1.8844 18.2209 59.2205 21.2232 44.5777 12.1698 19.4823 18.5218 8.2187 0.0751
temp: 298.150 k
press: 1.00000 atm
elementType: 35 35 8 6 6 6 6 6 6 6 6 1 1 1 1 1 1 1 1
symmnumber: 1
zpe: 360400.6 jmol-1
zpe.correction: 0.137269 hartree
zpe.thermalcorrener: 0.149044 hartree
zpe.thermalcorrenthalpy: 0.149988 hartree
zpe.thermalcorrgfe: 0.097553 hartree
zpe.sumelectzpe: -410.964038 hartree
zpe.sumelectthermal: -410.952264 hartree
zpe.sumelectthermalent: -410.951319 hartree
zpe.sumelectthermalfe: -411.003755 hartree
dipole: -0.0735 4.0804 0.0001
dipole: 4.0811
quadrupole: -84.5151 -68.0577 -86.3991
quadrupole: -4.7537 0.0027 0.0003
quadrupole: -4.8578 11.5996 -6.7418 -4.7537 0.0027 0.0003
hfenergy: -411.1013074 hartree
pointgroup: C01 [X(C8H8Br2O1)]
dipole: -0.2785878 -1.581265 -0.0000359 debye
dipolederiv: -0.6885719 -0.1284539 0.0000571 -0.1727543 -0.1086926 -0.0000249 0.0001628 -0.0000321 -0.0338839 -0.3290529 0.286607 0.0000983 0.3675513 -0.3617903 -0.0000032 0.000361 -0.0003375 -0.0059292 -1.4464332 -0.6939878 0.000008 -0.5210685 -0.561251 0.0000116 -0.0001228 0.0000305 -0.2813829 -0.090774 -0.1646985 -0.0000317 -0.2144713 0.2281365 0.000122 -0.000292 0.0004554 0.0509633 -0.2592139 -0.1535221 0.0000128 0.1485887 -0.0631163 0.0000304 -0.0000509 -0.0000017 -0.2237687 1.2172809 0.8172266 0.0000555 0.3828349 -0.0255306 0.0000347 0.0002573 -0.0000378 0.1656399 1.044118 0.3041228 -0.0002707 0.4164337 -0.0747858 -0.00003 -0.0003128 -0.0000436 -0.1860255 0.3103399 -0.6067458 -0.0001252 -0.8037271 0.5472532 -0.000003 -0.0005096 0.0004696 -0.181877 -0.2968465 0.0403255 0.0001259 0.0482694 -0.1305009 0.0000333 0.000266 -0.000093 -0.0111431 -0.0913896 0.1489183 0.0000575 0.1107057 0.0308754 -0.0000642 0.0001964 -0.0004642 0.0470451 0.4175423 0.1870599 -0.0000341 0.4919056 0.6519772 -0.0000109 -0.000024 -0.0000331 0.3229803 0.0459216 -0.028409 -0.000021 -0.0519447 -0.0807433 -0.0000123 -0.000001 -0.0000082 0.1635524 0.0954327 -0.0323118 -0.0000064 -0.0259438 0.0011311 -0.0000276 -0.0000481 0.0000217 0.1558856 0.0144366 0.0453768 -0.0912503 0.0222688 0.05526 -0.0336318 -0.1075503 0.0138743 -0.024194 0.0337077 -0.1581986 0.000327 -0.0443478 -0.1035621 0.0003661 0.000104 0.0004817 0.1076834 0.0149643 0.0457371 0.091015 0.0228251 0.0550843 0.0332548 0.1075741 -0.014282 -0.0250906 0.0726268 0.0692789 -0.0954442 -0.0949336 -0.0699336 0.075427 -0.0350926 0.1009581 -0.0837433 0.0726384 0.0692999 0.095393 -0.0949803 -0.0699774 -0.075472 0.035044 -0.1009504 -0.0837374 -0.1367272 -0.0476256 0.0000336 0.0127882 0.0801662 0. 0.0000385 -0.0000078 0.1270255 unknown
polarizability: 182.2130504|-6.7435695|135.8677131|-0.0140634|0.0098486|53.1947106 unknown
InChI: InChI=1S/C8H8Br2O/c1-5-3-8(11-2)7(10)4-6(5)9/h3-4H,1-2H3
charge 0 multiplicity 1
19 atoms
Br 3.540959 0.924321 -0.000457
Br -1.99462 2.596729 0.000082
O  -2.48402 -0.424466 -0.00033
C  1.260191 -0.937318 -0.000168
C  -0.129524 -1.220249 -0.000198
C  -1.110676 -0.197307 -0.000226
C  1.640135 0.427002 -0.000158
C  -0.680625 1.156665 -0.000128
C  0.689419 1.470102 -0.000114
C  2.269306 -2.067181 -0.000584
C  -2.950703 -1.81058 -0.000003
H  -0.441461 -2.269302 -0.000198
H  1.009799 2.515018 -0.000048
H  2.929011 -2.014434 0.885071
H  1.766549 -3.049049 0.001597
H  2.925551 -2.016633 -0.888972
H  -2.612025 -2.350486 0.905845
H  -2.612254 -2.350825 -0.905736
H  -4.048211 -1.742308 0.000121
