program: Gaussian 09
title: 000138510
version: EM64L-G09RevD.01
frameworkgroup: C1[X(C6H6N2O4S)]
method: RPBEPBE
basis: SDD
operation: Freq
keyword: #p
keyword: freq=noraman
keyword: PBEPBE/SDD
title: #p freq=noraman PBEPBE/SDD
converged: NO YES NO NO
title: Mulliken charges:
elementType: S O O O O N N C C C C C C H H H H H H
charge: 0.968538 -0.541819 -0.492557 -0.210900 -0.178437 -0.723941 0.027900 -0.177362 0.449117 -0.221117 -0.317982 -0.215684 -0.193578 0.315724 0.292539 0.255371 0.252040 0.349222 0.362926
chargesum: 0.00000
title: Mulliken charges with hydrogens summed into heavy atoms:
elementType: S O O O O N N C C C C C C
charge: 0.968538 -0.541819 -0.492557 -0.210900 -0.178437 -0.011794 0.027900 -0.177362 0.449117 0.094608 -0.025443 0.039687 0.058463
polarizability: 1.49709646e+02 3.62807534e+00 1.37636666e+02 5.91214895e+00 -2.63026476e+00 6.90413424e+01
1716.lowfreq: -5.9921 -2.9163 -0.0006 0.0015 0.0020 9.3967 44.7377 85.2257 120.7126
frequency: 44.7078 85.2241 120.7071 145.7876 174.9025 187.7423 231.7703 239.4878 266.3437 288.9986 329.7024 362.0598 387.8196 418.5891 428.7182 454.3761 504.2120 535.9548 624.3490 661.7308 672.4381 729.3722 777.1934 792.2337 792.6034 817.6035 906.1865 926.1007 988.1872 995.1464 1011.6376 1030.9510 1082.7563 1100.5850 1139.3785 1175.0954 1217.3313 1254.9309 1379.4833 1398.5846 1426.6986 1442.8350 1501.0299 1580.3269 1591.2532 3141.1626 3157.3295 3172.8902 3186.2001 3404.6296 3582.5862
redmass: 11.9332 6.0193 5.6495 10.7085 5.5019 7.5976 7.2808 2.8441 6.1989 2.2038 8.5711 2.9230 6.3485 4.3442 6.8307 3.2872 4.4352 5.8012 6.7884 5.5301 7.6384 3.4264 2.1144 9.6010 1.4125 6.4821 1.3843 6.0160 1.3668 6.7179 1.3594 2.5295 1.4010 2.2838 1.7888 1.0688 11.1007 1.4564 7.2958 9.7229 2.3188 2.3552 1.1042 6.3510 7.1424 1.0897 1.0895 1.0942 1.0992 1.0403 1.1028
irintensity: 1.2497 2.4267 1.2390 0.9288 6.5199 0.7578 2.6106 23.0624 4.5205 13.0806 8.4412 11.7601 36.2311 32.2038 51.2070 107.9021 38.2828 5.6213 2.3890 15.7829 10.0803 13.4509 137.7822 14.9067 78.3009 45.6189 1.6627 78.6154 4.7062 2.2221 0.7166 0.6043 37.0943 36.3666 0.5104 2.0503 220.8727 1.1603 134.4612 9.8100 40.4123 24.7571 42.9153 11.1802 11.5334 12.4881 0.6337 8.1820 7.5465 34.8815 52.5542
temp: 298.150 k
press: 1.00000 atm
elementType: 16 8 8 8 8 7 7 6 6 6 6 6 6 1 1 1 1 1 1
symmnumber: 1
zpe: 322201.7 jmol-1
zpe.correction: 0.122720 hartree
zpe.thermalcorrener: 0.135138 hartree
zpe.thermalcorrenthalpy: 0.136082 hartree
zpe.thermalcorrgfe: 0.083995 hartree
zpe.sumelectzpe: -1039.463538 hartree
zpe.sumelectthermal: -1039.451120 hartree
zpe.sumelectthermalent: -1039.450176 hartree
zpe.sumelectthermalfe: -1039.502263 hartree
dipole: -3.8917 -2.9715 2.9299
dipole: 5.7061
quadrupole: -73.6011 -86.0225 -87.2711
quadrupole: 12.8606 7.8068 3.4613
quadrupole: 8.6971 -3.7243 -4.9728 12.8606 7.8068 3.4613
hfenergy: -1039.5862582 hartree
pointgroup: C01 [X(C6H6N2O4S1)]
dipole: -1.9940873 0.4315999 -0.936519 debye
dipolederiv: 1.839399 0.2189343 -0.1665258 0.2534464 1.3515433 0.0128469 -0.0716908 -0.0003142 1.5495713 -0.6164581 -0.0799036 0.0298106 -0.0766217 -0.6536066 -0.05434 0.0165964 0.0589348 -0.4899588 -0.6599057 -0.0271664 -0.0398187 -0.0376743 -0.5324333 0.128995 -0.0975266 0.0185711 -0.6277507 -0.6910428 0.0043822 0.2462611 0.028365 -0.4967688 0.0239118 0.2499869 0.0702011 -0.2731533 -0.4150866 -0.0717497 0.0959631 -0.1289815 -0.8778544 0.1003381 0.1159567 0.0926111 -0.2485624 -0.6969636 0.0201601 0.0853248 -0.0243076 -0.4553073 -0.0319182 0.143721 0.0319202 -0.8560753 1.0242046 -0.2179823 -0.3904599 -0.1354527 1.5008376 -0.1068106 -0.3538108 -0.1264651 0.3270978 -0.0290761 0.0767651 -0.0180905 -0.360293 -0.0318554 0.0422919 -0.115458 -0.0703716 -0.1515891 -0.2830302 0.1888894 0.0629524 0.452846 -0.3055555 -0.0165147 0.0574066 -0.0226418 0.0650799 -0.4556201 0.1516528 0.0255304 -0.0231004 -0.0839845 -0.0049529 0.0444001 -0.0143082 -0.0721222 -0.062826 -0.1861408 -0.0079493 -0.0313182 -0.0055275 -0.0057514 -0.022033 0.0562313 -0.0727998 0.1827175 -0.1334813 -0.0298686 0.0183894 0.1590299 0.007653 0.0076793 0.0288245 -0.0998494 0.1831012 0.0711788 -0.0221885 -0.0215644 -0.2059143 -0.0033551 -0.0408057 -0.0061812 -0.1198425 0.1685155 -0.0362251 -0.0051927 0.0064351 0.099399 -0.0042248 -0.017941 0.0003633 0.1578305 0.0947071 -0.015785 -0.0021589 -0.0321639 0.0573498 -0.0064829 0.0294451 -0.0102654 0.1682761 0.0088309 0.0631965 0.0109985 0.0772008 0.0042491 -0.012098 0.0122871 -0.0149079 0.1566897 -0.0696338 -0.0166516 0.0176431 -0.0290094 0.0914865 -0.0016231 0.0119614 -0.0063887 0.1565018 0.1696985 -0.0770033 0.0516893 -0.0050738 0.1894195 -0.1213087 0.0145539 -0.0764907 0.2367462 0.3084689 0.0669299 0.0560797 0.0688781 0.1954928 0.0533438 0.0152714 -0.0093228 0.1939102 unknown
polarizability: 148.6208971|2.7012854|137.472482|-11.974175|-1.4337584|70.294276 unknown
InChI: InChI=1S/C6H6N2O4S/c7-13(11,12)6-4-2-1-3-5(6)8(9)10/h1-4H,7H2
charge 0 multiplicity 1
19 atoms
S  1.667668 1.131678 0.011301
O  1.670598 2.757177 0.112352
O  2.423111 0.265183 1.15387
O  1.330669 -1.701029 -0.723152
O  -0.335954 -3.018918 0.090002
N  2.198561 0.810345 -1.686167
N  0.149243 -1.872497 -0.231132
C  -0.19385 0.639314 -0.035875
C  -0.708777 -0.674193 -0.051255
C  -1.053415 1.742121 0.078045
C  -2.101497 -0.890014 0.060252
C  -2.448139 1.52878 0.170525
C  -2.968511 0.215068 0.168755
H  -0.615591 2.746484 0.107708
H  -2.472125 -1.918612 0.051639
H  -3.119915 2.388747 0.251418
H  -4.0471 0.050033 0.249508
H  2.919022 1.498364 -1.949552
H  2.434003 -0.183532 -1.812242
