program: Gaussian 09
title: 000138506
version: EM64L-G09RevD.01
frameworkgroup: C1[X(C10H13NO4)]
method: RPBEPBE
basis: SDD
operation: Freq
keyword: #p
keyword: freq=noraman
keyword: PBEPBE/SDD
title: #p freq=noraman PBEPBE/SDD
converged: YES YES NO NO
title: Mulliken charges:
elementType: O O O O N C C C C C C C C C C H H H H H H H H H H H H H
charge: -0.298479 -0.323825 -0.260783 -0.245495 -0.445451 0.222029 -0.043881 0.321869 0.075622 -0.789986 -0.761669 0.151387 0.159132 -0.502558 -0.495584 0.341323 0.242898 0.263830 0.242877 0.258885 0.206524 0.258940 0.225815 0.240990 0.241583 0.243315 0.227674 0.243018
chargesum: 0.00000
title: Mulliken charges with hydrogens summed into heavy atoms:
elementType: O O O O N C C C C C C C C C C
charge: -0.298479 -0.323825 -0.260783 -0.245495 -0.104128 0.222029 -0.043881 0.321869 0.075622 -0.040381 -0.037319 0.151387 0.159132 0.205830 0.218423
polarizability: 2.07199007e+02 -1.26141670e+00 1.39580947e+02 -3.83105618e-02 -1.57000503e-02 7.14867654e+01
1716.lowfreq: -6.4094 -2.0487 -0.0005 -0.0001 0.0003 1.6915 41.7854 54.1828 77.3444
frequency: 41.7084 54.1469 77.3404 84.3152 96.3218 98.1535 101.2996 120.3502 126.9047 153.2342 158.0496 180.8152 257.0270 267.5821 277.6672 279.2733 306.8191 340.3283 348.5669 422.8068 473.3618 575.9054 604.8027 618.8456 636.6379 704.1982 707.3922 725.7897 742.3164 749.5519 795.4841 899.7264 934.9667 987.3832 1028.6529 1038.8367 1045.0943 1051.1401 1060.8510 1112.4644 1115.3677 1142.2159 1144.6434 1176.2288 1244.8391 1252.0810 1334.0753 1402.8153 1407.8711 1416.6170 1420.2828 1436.2415 1446.2326 1447.8590 1449.2089 1451.2380 1463.7361 1467.4550 1468.0641 1469.8341 1493.9214 1511.9262 1566.2790 1628.0478 1650.2399 2992.7136 2994.3979 3001.0670 3002.1110 3067.4035 3083.6218 3090.5965 3101.2314 3102.8618 3119.0712 3141.0685 3141.9283 3583.7478
redmass: 3.9960 3.7897 1.5632 1.2376 1.8993 4.2530 1.0963 1.3804 1.8796 2.9094 3.5730 4.2021 7.7114 2.7402 3.6227 5.8196 4.0331 4.9913 4.3269 8.6528 5.4688 3.8871 4.3404 5.7318 6.1707 1.1447 5.9808 9.6183 5.6943 7.1437 5.2054 8.2685 3.8595 1.6647 3.6272 1.4665 1.5250 6.9221 2.8847 1.2632 1.2608 1.4433 1.4145 4.1145 1.8771 4.1969 5.0823 1.3011 1.2704 1.3005 1.4134 2.4574 1.0444 1.2942 1.0507 1.0495 1.1723 1.0847 1.1394 1.0458 2.3839 5.1545 5.4748 10.0138 9.8428 1.0367 1.0375 1.0294 1.0295 1.0957 1.0971 1.1003 1.1043 1.1045 1.1005 1.1046 1.1046 1.0809
irintensity: 1.0728 0.1995 0.0014 0.0109 1.4094 0.3372 0.0004 1.9129 0.0311 11.9707 0.2792 5.6863 6.4347 4.9442 9.2846 1.0024 9.0407 19.8656 0.0047 3.3025 0.4342 3.2071 1.6285 1.5010 2.0342 96.5023 10.9804 3.6938 4.9265 8.2811 41.1274 24.3573 3.2182 19.4049 461.3495 3.1653 8.5826 28.5602 113.7189 0.0428 0.0691 75.1587 24.7582 121.9979 82.6589 188.9515 85.3324 31.0068 1.1770 5.1511 6.2814 96.2144 15.5370 171.9733 10.9369 14.1528 37.8818 23.8191 3.3138 14.5263 8.7832 41.4144 34.8693 362.0957 359.5213 24.1973 8.3918 57.9320 39.3134 10.3279 7.1739 19.2438 27.5239 28.6643 4.0283 17.4410 18.2961 94.6169
temp: 298.150 k
press: 1.00000 atm
elementType: 8 8 8 8 7 6 6 6 6 6 6 6 6 6 6 1 1 1 1 1 1 1 1 1 1 1 1 1
symmnumber: 1
zpe: 572504.3 jmol-1
zpe.correction: 0.218055 hartree
zpe.thermalcorrener: 0.234832 hartree
zpe.thermalcorrenthalpy: 0.235776 hartree
zpe.thermalcorrgfe: 0.172858 hartree
zpe.sumelectzpe: -743.403946 hartree
zpe.sumelectthermal: -743.387169 hartree
zpe.sumelectthermalent: -743.386225 hartree
zpe.sumelectthermalfe: -743.449143 hartree
dipole: 0.0159 5.2818 -0.0047
dipole: 5.2819
quadrupole: -71.4507 -88.1194 -87.8918
quadrupole: 2.7773 0.0131 0.0170
quadrupole: 11.0366 -5.6321 -5.4046 2.7773 0.0131 0.0170
hfenergy: -743.6220009 hartree
pointgroup: C01 [X(C10H13N1O4)]
dipole: 0.009098 2.0771355 0.0607891 debye
polarizability: 207.1980063|0.8035703|139.510612|-1.449189|1.9409254|71.558101 unknown
InChI: InChI=1S/C10H13NO4/c1-5-7(9(12)14-3)6(2)11-8(5)10(13)15-4/h11H,1-4H3
charge 0 multiplicity 1
28 atoms
O  3.357707 0.540058 -0.061416
O  -3.410783 0.853886 0.014987
O  2.799786 -1.72466 -0.127163
O  -3.225913 -1.485477 -0.051772
N  -0.778977 1.266676 -0.002326
C  -0.118642 -0.912849 -0.069873
C  1.041842 -0.046377 -0.057901
C  0.59393 1.307622 -0.015294
C  -1.244066 -0.063617 -0.034668
C  -0.13457 -2.415298 -0.111594
C  1.337739 2.610373 0.013908
C  2.426099 -0.523209 -0.086041
C  -2.668858 -0.359257 -0.02691
C  4.777096 0.120937 -0.088932
C  -4.879462 0.688836 0.028449
H  -1.413488 2.065281 0.026813
H  0.418554 -2.835828 0.747282
H  -1.168439 -2.792648 -0.105136
H  0.389111 -2.786453 -1.01079
H  1.98884 2.712171 -0.87106
H  0.639734 3.466213 0.043613
H  2.00431 2.66352 0.891631
H  5.348496 1.0597 -0.052352
H  4.995494 -0.440645 -1.013113
H  5.007679 -0.518694 0.779815
H  -5.214514 0.15588 -0.87743
H  -5.281244 1.711952 0.055659
H  -5.193363 0.116707 0.917912
