program: Gaussian 09
title: 000138505
version: EM64L-G09RevD.01
frameworkgroup: C1[X(C10H20O)]
method: RPBEPBE
basis: SDD
operation: Freq
keyword: #pfreq=noraman
keyword: PBEPBE/SDD
title: #p freq=noraman PBEPBE/SDD
converged: YES YES NO NO
title: Mulliken charges:
elementType: O C C C C C C C C C C H H H H H H H H H H H H H H H H H H H H
charge: -0.474822 0.395365 -0.499780 -0.505551 -0.492701 -0.406261 -0.381015 -0.389728 -0.357463 -0.356100 -0.698452 0.230629 0.192791 0.199470 0.198270 0.189478 0.203585 0.223020 0.189122 0.188760 0.207771 0.183216 0.202785 0.214969 0.202955 0.319714 0.192052 0.191673 0.209877 0.212107 0.214263
chargesum: 0.00000
title: Mulliken charges with hydrogens summed into heavy atoms:
elementType: O C C C C C C C C C C
charge: -0.155108 0.395365 -0.076360 -0.107811 -0.099638 0.005882 0.015516 -0.003727 0.060461 0.027625 -0.062205
polarizability: 1.29002993e+02 2.31433906e-01 1.02510999e+02 -7.82840449e-01 -3.34778926e-01 9.43755511e+01
1716.lowfreq: -0.0004 0.0005 0.0007 6.2505 16.3877 24.3048 59.7409 67.4896 99.3467
frequency: 58.6417 67.4203 98.8085 129.3334 154.0305 196.6533 233.6790 243.6129 264.2133 290.8685 303.9502 332.5807 376.8892 408.8942 450.9856 466.6482 491.9012 610.3595 711.4686 733.7543 774.2123 779.9232 825.6533 851.0734 885.8465 888.1040 917.6895 924.0608 944.4780 956.9748 1024.4145 1051.7627 1058.5720 1067.5250 1080.1869 1090.6816 1109.0449 1113.0142 1130.0765 1164.1456 1169.5562 1210.5627 1243.6950 1257.0577 1262.2413 1271.0524 1282.4358 1289.6970 1318.6816 1333.1286 1337.9546 1342.1349 1347.3240 1347.8713 1360.3913 1380.2499 1389.2368 1446.1678 1452.2326 1456.0362 1460.3880 1466.8339 1467.6037 1473.7335 1476.6166 1478.1103 1488.4864 2935.7918 2952.8841 2958.1449 2958.5880 2971.8054 2975.8717 2977.7207 2983.0472 2987.1929 2995.0022 3002.1349 3011.1574 3026.7973 3041.4978 3042.4463 3048.0911 3059.2005 3068.9812 3070.1240 3539.7692
redmass: 3.1980 1.6588 2.8998 2.6753 2.2954 2.3523 1.1402 2.4704 3.9092 1.2338 1.9299 2.2742 2.1268 1.9852 2.5919 2.5912 2.3428 2.7051 4.0705 1.0882 1.5042 1.2807 2.4103 1.7717 1.7200 1.9932 2.1179 1.4035 1.5028 2.2274 3.5214 1.5699 1.7913 1.8614 1.9587 1.2523 1.7662 1.8267 2.0298 1.8570 1.7518 1.4486 1.3467 1.3095 1.3016 1.2363 1.3029 1.1179 1.3500 1.4393 1.4656 1.4601 1.5338 1.4855 1.5521 1.7251 1.2182 1.0852 1.0863 1.0898 1.0950 1.0813 1.0682 1.0939 1.0426 1.0687 1.0831 1.0629 1.0600 1.0632 1.0588 1.0371 1.0592 1.0628 1.0629 1.0631 1.0942 1.1001 1.0984 1.0955 1.1020 1.1035 1.0998 1.1006 1.1006 1.0994 1.0656
irintensity: 0.0908 0.0226 0.2313 0.6573 2.0360 1.6841 0.1066 0.2918 0.5474 77.9505 59.8484 18.0221 5.7441 1.2526 2.4209 6.9426 3.0504 4.1296 2.3786 6.7584 0.5645 3.6285 9.8492 7.9123 7.5788 9.2581 9.0490 10.9466 22.6840 14.4634 3.0788 6.6491 0.2910 1.3643 1.8889 10.4215 9.9846 15.2919 15.2162 16.3994 0.4895 1.8156 8.0612 2.9598 6.5759 3.2057 9.6902 1.2656 1.8388 4.0033 1.4571 0.5837 7.7134 2.2383 1.4450 11.5540 11.5979 0.5257 4.7044 9.4073 8.8935 11.6289 2.7477 4.1145 12.4940 2.1273 16.9296 17.3957 43.3334 38.5653 33.5667 32.8254 64.2021 31.3035 33.7201 37.3440 9.0768 8.0454 41.2295 69.8187 33.5982 28.4554 54.3458 69.3277 88.3736 55.6147 3.3435
temp: 298.150 k
press: 1.00000 atm
elementType: 8 6 6 6 6 6 6 6 6 6 6 1 1 1 1 1 1 1 1 1 1 1 1 1 1 1 1 1 1 1 1
symmnumber: 1
zpe: 739757.9 jmol-1
zpe.correction: 0.281759 hartree
zpe.thermalcorrener: 0.294388 hartree
zpe.thermalcorrenthalpy: 0.295332 hartree
zpe.thermalcorrgfe: 0.243455 hartree
zpe.sumelectzpe: -467.369997 hartree
zpe.sumelectthermal: -467.357367 hartree
zpe.sumelectthermalent: -467.356423 hartree
zpe.sumelectthermalfe: -467.408301 hartree
dipole: -0.2511 -1.2712 -0.9892
dipole: 1.6302
quadrupole: -71.7159 -68.4170 -71.3596
quadrupole: 0.0798 -0.9694 -3.0917
quadrupole: -1.2184 2.0805 -0.8621 0.0798 -0.9694 -3.0917
hfenergy: -467.6517555 hartree
pointgroup: C01 [X(C10H20O1)]
dipole: 0.0966083 -0.4810113 0.4130888 debye
polarizability: 129.0044877|-0.3396066|102.5259514|-0.6972526|-0.0577566|94.3591042 unknown
InChI: InChI=1S/C10H20O/c1-2-3-7-10(11)8-5-4-6-9-10/h11H,2-9H2,1H3
charge 0 multiplicity 1
31 atoms
O  -0.406851 -0.353948 -1.5767
C  -0.415011 -0.285843 -0.084912
C  -0.786093 1.180096 0.235006
C  -1.489971 -1.261366 0.469956
C  0.98604 -0.681467 0.455868
C  -2.227031 1.539117 -0.197375
C  -2.920649 -0.897433 0.014693
C  -3.263978 0.560082 0.400926
C  2.156361 0.204119 -0.024096
C  3.535205 -0.373316 0.368653
C  4.711165 0.520466 -0.080853
H  -0.066258 1.848384 -0.270983
H  -0.670746 1.333756 1.327459
H  -1.442434 -1.242239 1.578395
H  -1.235758 -2.297554 0.161405
H  1.184932 -1.734448 0.155012
H  0.952421 -0.681484 1.565061
H  -2.284127 1.498588 -1.301742
H  -2.456977 2.578927 0.106855
H  -3.648152 -1.601442 0.463651
H  -2.9918 -1.006017 -1.08525
H  -3.268644 0.655291 1.507756
H  -4.281918 0.819999 0.05157
H  2.097125 0.317252 -1.124733
H  2.059811 1.222171 0.403333
H  -0.199174 -1.288244 -1.837936
H  3.648127 -1.383779 -0.076173
H  3.576028 -0.513823 1.468783
H  4.641805 1.52591 0.375859
H  4.710068 0.652178 -1.179321
H  5.685885 0.085068 0.207132
