program: Gaussian 09
title: 000138504
version: EM64L-G09RevD.01
frameworkgroup: C1[X(C9H18O)]
method: RPBEPBE
basis: SDD
operation: Freq
keyword: #pfreq=noraman
keyword: PBEPBE/SDD
title: #p freq=noraman PBEPBE/SDD
converged: YES YES NO NO
title: Mulliken charges:
elementType: O C C C C C C C C C H H H H H H H H H H H H H H H H H H
charge: -0.475198 0.388689 -0.497788 -0.502434 -0.405039 -0.379721 -0.389059 -0.457172 -0.365161 -0.703104 0.230286 0.192500 0.198952 0.197752 0.222852 0.189251 0.188886 0.207254 0.185318 0.201040 0.183286 0.202808 0.210680 0.222992 0.319965 0.207406 0.206758 0.218002
chargesum: 0.00000
title: Mulliken charges with hydrogens summed into heavy atoms:
elementType: O C C C C C C C C C
charge: -0.155233 0.388689 -0.075003 -0.105729 0.007064 0.016419 -0.002965 -0.070815 0.068511 -0.070938
polarizability: 1.13579483e+02 6.82828261e-01 9.31279951e+01 -3.16855336e-01 -4.91019471e-01 8.58445000e+01
1716.lowfreq: -30.2369 -17.7834 -0.0010 -0.0007 -0.0005 8.8175 76.6696 93.8062 129.7934
frequency: 76.1142 93.6484 129.6113 151.6534 204.9473 239.4373 279.5651 286.6937 302.6880 309.1926 347.6750 405.6371 414.0271 466.8101 487.8823 613.2719 710.2878 742.7237 773.5607 821.3640 843.2868 849.3941 884.4356 913.8820 924.6016 928.9972 964.2770 1037.2661 1049.8100 1062.9186 1065.6344 1087.5491 1098.5274 1115.2274 1129.8822 1163.7699 1170.4716 1223.4610 1245.9542 1262.7421 1271.5805 1276.7660 1299.3768 1317.2697 1337.4008 1342.8713 1344.4004 1346.2928 1359.3292 1375.4026 1391.6582 1446.3045 1450.2126 1459.0789 1460.2075 1467.2384 1474.4901 1476.2585 1478.6210 1487.9211 2936.0290 2952.4258 2958.6408 2969.3045 2975.9369 2982.8078 2985.4908 2987.8761 2995.4664 3010.2197 3026.9941 3037.0107 3041.8212 3047.2353 3058.4553 3068.2232 3070.1174 3540.0647
redmass: 2.8132 1.8435 2.5702 2.6722 2.1247 1.1545 2.5734 1.3662 1.7781 3.2646 2.1073 1.8892 2.5861 2.7042 2.1589 2.5986 3.8860 1.1405 1.4944 2.6306 1.5212 1.6585 2.2628 1.6876 1.8566 1.5379 2.2112 1.9042 1.9973 1.6869 1.8895 1.2937 1.8150 1.6325 2.0390 1.9407 1.6840 1.3698 1.3761 1.3263 1.2430 1.2053 1.3638 1.3173 1.4590 1.4573 1.5702 1.4152 1.5267 1.6737 1.2191 1.0862 1.0876 1.0867 1.0944 1.0824 1.0941 1.0471 1.0444 1.0844 1.0625 1.0602 1.0633 1.0358 1.0633 1.0631 1.0612 1.0627 1.0943 1.0981 1.0955 1.1009 1.1018 1.0993 1.1012 1.1012 1.0992 1.0656
irintensity: 0.0299 0.0664 0.2651 2.6496 1.1972 0.0291 7.4504 91.0785 38.1215 4.9671 14.6647 0.1361 4.4782 7.0998 3.6407 3.3477 2.7608 3.8490 0.4978 14.8978 5.6057 10.8390 7.7536 14.3637 12.3445 12.0115 15.8372 4.9538 0.2379 0.4925 0.7564 12.3154 15.7928 13.7168 14.7542 18.6913 0.1427 1.2922 10.6848 2.1344 3.6755 4.9561 7.5521 2.0325 1.8789 2.8051 2.7467 3.5250 3.6066 8.8668 11.2763 2.5187 3.3020 10.3737 6.9738 14.8398 4.8983 3.8315 11.3966 12.5434 18.9832 50.8938 39.5373 51.1105 34.2876 32.9985 33.3925 34.2622 6.4059 51.9674 68.1679 4.4717 36.2589 27.5703 76.4780 82.4109 57.0915 3.3160
temp: 298.150 k
press: 1.00000 atm
elementType: 8 6 6 6 6 6 6 6 6 6 1 1 1 1 1 1 1 1 1 1 1 1 1 1 1 1 1 1
symmnumber: 1
zpe: 666234.3 jmol-1
zpe.correction: 0.253755 hartree
zpe.thermalcorrener: 0.265000 hartree
zpe.thermalcorrenthalpy: 0.265944 hartree
zpe.thermalcorrgfe: 0.217701 hartree
zpe.sumelectzpe: -428.146847 hartree
zpe.sumelectthermal: -428.135602 hartree
zpe.sumelectthermalent: -428.134658 hartree
zpe.sumelectthermalfe: -428.182901 hartree
dipole: -0.3373 -1.1812 -0.9959
dipole: 1.5814
quadrupole: -64.7956 -61.8270 -65.0663
quadrupole: 0.4578 -0.9002 -2.9146
quadrupole: -0.8993 2.0693 -1.1700 0.4578 -0.9002 -2.9146
hfenergy: -428.4006026 hartree
pointgroup: C01 [X(C9H18O1)]
dipole: 0.1257413 -0.4522488 0.4083665 debye
polarizability: 113.5713382|-0.8436792|93.1639035|-0.0414978|0.239861|85.8167366 unknown
InChI: InChI=1S/C9H18O/c1-2-6-9(10)7-4-3-5-8-9/h10H,2-8H2,1H3
charge 0 multiplicity 1
28 atoms
O  0.082001 -0.314719 -1.578032
C  0.079185 -0.23232 -0.086657
C  -0.406307 1.202754 0.221775
C  -0.912068 -1.283893 0.485482
C  -1.873291 1.4417 -0.20483
C  -2.371004 -1.03689 0.038816
C  -2.826048 0.392465 0.413043
C  1.512592 -0.50474 0.444795
C  2.597953 0.473526 -0.057385
C  4.02246 0.008172 0.312766
H  0.254738 1.921592 -0.294879
H  -0.296839 1.375471 1.312057
H  -0.857243 -1.251572 1.593229
H  -0.580335 -2.299869 0.183257
H  -1.933207 1.380571 -1.308044
H  -2.182767 2.464383 0.086623
H  -3.036894 -1.792393 0.499485
H  -2.441277 -1.161184 -1.059612
H  1.799542 -1.539241 0.150831
H  1.49177 -0.497618 1.554349
H  -2.831226 0.499889 1.518682
H  -3.863655 0.566795 0.068348
H  2.422241 1.480205 0.369056
H  2.504793 0.576234 -1.155792
H  0.356051 -1.233899 -1.831702
H  4.140742 -0.089373 1.409028
H  4.247017 -0.978288 -0.136117
H  4.785776 0.722943 -0.046073
