program: Gaussian 09
title: 000138500
version: EM64L-G09RevD.01
frameworkgroup: C1[X(C10H12O3)]
method: RPBEPBE
basis: SDD
operation: Freq
keyword: #pfreq=noraman
keyword: PBEPBE/SDD
title: #p freq=noraman PBEPBE/SDD
converged: YES YES NO NO
title: Mulliken charges:
elementType: O O O C C C C C C C C C C H H H H H H H H H H H H
charge: -0.258324 -0.447686 -0.259847 -0.393055 -0.261122 0.358372 -0.677142 -0.365516 -0.335292 0.249983 -0.329282 -0.327772 0.105409 0.220797 0.220762 0.206931 0.207005 0.210872 0.229954 0.210800 0.256802 0.251082 0.272404 0.272031 0.381834
chargesum: 0.00000
title: Mulliken charges with hydrogens summed into heavy atoms:
elementType: O O O C C C C C C C C C C
charge: -0.258324 -0.065852 -0.259847 0.048504 0.152815 0.358372 -0.025517 -0.108714 -0.084210 0.249983 -0.056878 -0.055741 0.105409
polarizability: 2.00876136e+02 7.61426761e-02 1.14432235e+02 -1.28469735e-02 1.11642360e-03 6.15599554e+01
1716.lowfreq: -21.4920 -9.9244 -4.4762 -0.0005 0.0004 0.0007 34.1186 60.7687 80.1121
frequency: 33.9013 60.2026 80.0458 80.7585 112.2352 153.5674 181.4758 229.3917 249.6877 288.0171 289.1543 401.1474 416.6717 462.6255 497.3930 499.4787 581.6011 582.0295 627.1125 684.5531 706.3668 757.3440 766.2901 806.6895 824.3610 856.2508 894.1651 902.7748 972.0023 972.7237 990.2145 994.4489 1015.5722 1054.0121 1117.9751 1136.1397 1140.5326 1151.1793 1184.2479 1229.0825 1233.7664 1285.8296 1298.4238 1309.0669 1322.8346 1372.1514 1385.3052 1397.8323 1431.8643 1470.6133 1477.8779 1482.7499 1488.0206 1498.5447 1572.4945 1620.6425 1641.3754 2951.8259 2979.8803 3005.8501 3011.7742 3054.2659 3082.4712 3085.5804 3154.0734 3159.2979 3174.4593 3180.4335 3532.6522
redmass: 4.6780 2.0785 4.3776 4.2390 3.5361 3.2416 5.4514 1.1228 5.3401 5.7196 3.5277 5.5801 2.9742 6.0169 2.6798 4.4859 5.3188 1.2174 7.0273 3.5664 5.4641 4.5366 1.0852 6.5712 1.3016 1.6380 1.1450 1.7580 5.9299 1.3656 1.3442 4.4890 2.7056 2.8041 1.2997 2.1706 1.4423 1.5909 1.3528 1.2663 3.2983 1.1038 1.3607 1.3524 2.6208 1.9196 2.7396 1.2404 4.3327 1.0949 1.0957 1.0411 1.1566 2.1388 7.6809 6.3341 8.3698 1.0551 1.0364 1.0600 1.1064 1.1017 1.1031 1.0987 1.0884 1.0878 1.0969 1.0969 1.0641
irintensity: 0.0088 0.0764 0.1337 0.0109 0.1309 4.0359 0.8454 0.1441 2.7168 5.5505 1.0908 7.9570 0.8537 2.2257 38.2762 11.4970 62.7127 81.3413 1.3263 70.2617 1.2911 24.4520 8.2084 6.1416 5.8190 56.2250 3.7753 4.3137 180.5030 1.1381 0.1607 89.6846 179.8697 5.4130 6.8677 4.9877 0.2635 220.0949 53.0349 0.3493 262.2690 0.0006 29.9180 1.1243 129.1762 5.9960 1.7188 22.2922 26.5402 21.8766 5.6866 13.9448 46.8716 56.9549 56.0020 199.2349 356.7223 31.0120 37.2419 23.1522 24.4020 0.0474 81.5710 41.3582 0.4716 7.4548 6.0482 5.0619 46.8679
temp: 298.150 k
press: 1.00000 atm
elementType: 8 8 8 6 6 6 6 6 6 6 6 6 6 1 1 1 1 1 1 1 1 1 1 1 1
symmnumber: 1
zpe: 524235.8 jmol-1
zpe.correction: 0.199671 hartree
zpe.thermalcorrener: 0.212531 hartree
zpe.thermalcorrenthalpy: 0.213475 hartree
zpe.thermalcorrgfe: 0.159234 hartree
zpe.sumelectzpe: -612.972156 hartree
zpe.sumelectthermal: -612.959296 hartree
zpe.sumelectthermalent: -612.958352 hartree
zpe.sumelectthermalfe: -613.012594 hartree
dipole: 3.7958 -2.3702 0.0011
dipole: 4.4750
quadrupole: -72.4433 -73.9788 -78.8954
quadrupole: 5.0053 0.0016 -0.0019
quadrupole: 2.6625 1.1271 -3.7896 5.0053 0.0016 -0.0019
hfenergy: -613.1718274 hartree
pointgroup: C01 [X(C10H12O3)]
dipole: 1.4923585 -0.9341413 -0.0024775 debye
dipolederiv: -2.2659469 0.1193646 -0.0002587 0.026303 -0.3039535 -0.0001107 -0.0006915 0.0000862 -0.276232 -0.6184943 -0.3850369 -0.0014107 -0.663289 -1.1209259 -0.0025036 -0.0020848 -0.0020574 -0.4310236 -1.230791 0.2664391 0.0006585 0.3048375 -0.7443141 -0.0011599 0.001415 -0.0015955 -0.3408242 -0.0164892 0.0209975 0.0001258 0.0852886 0.0726702 -0.0002121 0.0006024 -0.0002651 0.1359673 1.0039132 -0.1648179 -0.000597 -0.6000772 0.3270805 -0.0006298 -0.0015286 -0.0003471 0.3930983 1.8628919 0.0260001 0.0006888 0.429179 0.1739848 0.0004244 0.0017481 0.0001846 0.1261031 -0.0706871 0.0389152 0.0001341 -0.0475355 0.0393852 -0.0005479 -0.0004841 -0.0005163 0.1017573 -0.6409386 0.05472 0.0000447 0.3241447 0.0421064 0.0009177 0.0009333 0.0008517 -0.1855069 -0.5265402 -0.0727799 -0.0004336 -0.5503516 -0.1102006 0.0002479 -0.0020599 0.0004027 -0.2127051 -1.0888334 -0.0707927 -0.0004521 -0.1343545 -0.2015978 -0.0006513 -0.0006996 -0.0006292 -0.0277016 0.3707852 0.0133029 0.0001919 0.2812648 0.1191685 0.0008932 0.0010745 0.0008138 -0.1053779 0.4750962 0.0004616 0.000173 -0.1364578 0.0747129 0.0005984 -0.0004406 0.0005964 -0.0961179 2.3056551 0.1355834 0.0008287 0.3154456 1.423894 0.0039842 0.000858 0.004014 0.2309751 0.0547939 0.0138374 0.0007079 -0.0244799 -0.0130174 0.1063555 0.01457 0.1251253 -0.0606039 0.0543825 0.0137649 -0.0004677 -0.0242833 -0.0101196 -0.1058412 -0.0149672 -0.1246061 -0.0637859 -0.0323753 -0.0212861 -0.041099 0.1094006 -0.0493272 -0.0920823 -0.0080046 -0.1097208 -0.0862763 -0.0324734 -0.0221972 0.0413941 0.1087137 -0.0508802 0.0924151 0.0090507 0.1098573 -0.0842078 0.0974965 -0.0139305 -0.0426042 0.038168 -0.0172934 -0.1152805 0.0015628 -0.1343679 -0.0859692 -0.1925426 -0.0653821 -0.0007733 -0.0901293 0.0459412 -0.0005751 -0.0009116 -0.0005435 0.1073907 0.0975551 -0.0148526 0.0427371 0.0379838 -0.0210876 0.1163806 -0.0006463 0.1353142 -0.0821351 0.0657597 -0.0669674 -0.0002674 -0.0624636 -0.023719 -0.000737 -0.000253 -0.0007396 0.1698191 0.0027309 0.0921698 0.0003349 0.1148022 0.0000532 -0.0005907 0.0004529 -0.0005718 0.164558 0.0647635 0.0863453 0.0002774 0.046339 0.0325268 -0.0004343 0.00015 -0.000424 0.1552355 0.1039725 -0.03907 -0.000175 -0.0436479 -0.0066452 -0.0006274 -0.0002293 -0.0006132 0.1559957 0.156316 0.0552115 0.0002417 0.1551991 0.3215579 -0.0002331 0.0005834 -0.0002487 0.3975672 unknown
polarizability: 200.876191|-0.0185481|114.4314507|0.036438|0.1952638|61.5606849 unknown
InChI: InChI=1S/C10H12O3/c1-2-7-13-9-5-3-8(4-6-9)10(11)12/h3-6,11H,2,7H2,1H3
charge 0 multiplicity 1
25 atoms
O  2.116775 0.716016 0.003191
O  -3.896031 -1.560473 -0.005854
O  -4.362642 0.714296 0.002063
C  4.491568 0.259203 0.005431
C  3.104175 -0.385558 0.000424
C  0.759722 0.393583 0.001688
C  5.612608 -0.802623 -0.001373
C  -0.127144 1.50455 0.005528
C  0.247347 -0.931627 -0.003437
C  -2.037432 -0.032277 -0.000737
C  -1.511315 1.290788 0.004287
C  -1.145958 -1.134366 -0.004568
C  -3.505687 -0.205829 -0.001697
H  4.581365 0.91726 -0.878577
H  4.580923 0.905425 0.898151
H  2.956982 -1.010556 -0.904831
H  2.953615 -1.018048 0.899875
H  5.5566 -1.44475 -0.900418
H  6.605328 -0.31972 0.003327
H  5.554839 -1.458338 0.887718
H  0.298104 2.512279 0.009372
H  0.9177 -1.795245 -0.006571
H  -2.211063 2.132661 0.007155
H  -1.555865 -2.148238 -0.008466
H  -4.889815 -1.596514 -0.005681
