program: Gaussian 09
title: 000138499
version: EM64L-G09RevD.01
frameworkgroup: C1[X(C9H11Br)]
method: RPBEPBE
basis: SDD
operation: Freq
keyword: #pfreq=noraman
keyword: PBEPBE/SDD
title: #p freq=noraman PBEPBE/SDD
converged: NO NO NO NO
title: Mulliken charges:
elementType: Br C C C C C C C C C H H H H H H H H H H H
charge: -0.011271 -0.234260 0.557956 -0.687245 -0.687273 -0.333266 -0.459741 -0.215076 -0.205986 -0.217082 0.209608 0.213504 0.214513 0.228443 0.228451 0.214514 0.213482 0.250649 0.237470 0.232071 0.250538
chargesum: 0.00000
title: Mulliken charges with hydrogens summed into heavy atoms:
elementType: Br C C C C C C C C C
charge: -0.011271 -0.024652 0.557956 -0.030785 -0.030826 -0.082617 -0.222271 -0.215076 0.026086 0.033455
polarizability: 1.48813334e+02 -5.48483489e+00 1.16995530e+02 2.30534624e-03 -1.91993643e-03 6.24573238e+01
1716.lowfreq: -12.5275 -5.1756 -0.0005 -0.0004 -0.0001 12.6567 28.1804 108.1154 120.0969
frequency: 26.7872 108.1103 120.0937 174.0035 220.7610 247.0632 277.8628 300.2647 307.9198 313.0840 441.3470 456.9642 552.3898 580.1000 649.2312 701.4734 772.0679 792.5313 892.9216 899.5006 908.1607 919.8695 954.7593 980.6136 982.2392 1052.9137 1071.1830 1087.4837 1110.9612 1153.3564 1179.2655 1219.8519 1276.5467 1302.2589 1329.7804 1372.7064 1376.5193 1394.7936 1419.8423 1458.0665 1465.5308 1468.8576 1477.8933 1489.1597 1570.0469 1597.9588 2971.9458 2974.3864 2978.6849 3065.4559 3072.6495 3074.9654 3078.9169 3124.3064 3142.9828 3145.6545 3166.6872
redmass: 2.8507 3.4015 4.5137 4.2312 1.0366 1.1599 3.9456 4.0827 3.0885 3.2888 3.0662 2.9754 2.9821 4.7135 6.7466 2.0748 4.1017 1.4294 2.6062 1.4829 1.3174 1.2074 1.4663 1.3453 5.9953 2.0406 1.7927 1.5908 2.5509 1.8451 1.0921 1.9304 1.3665 1.3276 1.7397 5.4011 1.1912 1.2161 2.2354 2.2418 1.0462 1.0490 1.0483 1.0987 6.2237 6.5768 1.0348 1.0352 1.0843 1.1001 1.0992 1.1007 1.0999 1.0875 1.0915 1.0923 1.0984
irintensity: 0.0497 0.9989 0.0947 0.0751 0.0007 0.0334 1.1820 2.1648 0.4186 0.4528 8.1575 0.4464 0.1534 0.0206 13.3438 33.3407 43.4233 43.7203 9.1312 12.8994 0.1933 1.8372 0.1476 0.5346 8.2348 18.2752 16.3235 8.5423 1.2467 3.0096 0.6564 17.0320 9.1652 0.6219 6.7756 3.7827 14.9087 9.8351 25.0097 19.9545 5.5699 1.2905 16.3248 20.4924 52.4822 32.3842 30.5557 28.2359 18.0406 1.5715 95.9151 23.2321 41.5877 7.8966 10.7831 9.4073 11.2549
temp: 298.150 k
press: 1.00000 atm
elementType: 35 6 6 6 6 6 6 6 6 6 1 1 1 1 1 1 1 1 1 1 1
symmnumber: 1
zpe: 450105.3 jmol-1
zpe.correction: 0.171436 hartree
zpe.thermalcorrener: 0.181773 hartree
zpe.thermalcorrenthalpy: 0.182717 hartree
zpe.thermalcorrgfe: 0.133972 hartree
zpe.sumelectzpe: -362.274743 hartree
zpe.sumelectthermal: -362.264406 hartree
zpe.sumelectthermalent: -362.263462 hartree
zpe.sumelectthermalfe: -362.312207 hartree
dipole: -2.4170 0.8357 0.0000
dipole: 2.5574
quadrupole: -66.2204 -63.5372 -73.6265
quadrupole: 1.3610 0.0002 -0.0004
quadrupole: 1.5743 4.2575 -5.8318 1.3610 0.0002 -0.0004
hfenergy: -362.4461787 hartree
pointgroup: C01 [X(C9H11Br1)]
dipole: 0.7882901 -0.625236 -0.0005181 debye
dipolederiv: -0.3824502 0.3003576 0.0002402 0.3692987 -0.4630295 -0.0004091 0.0002727 -0.0002564 -0.0535115 0.1599785 -0.0544161 -0.0000865 -0.083719 0.0840344 -0.0000136 -0.0002171 -0.0001205 0.1267649 0.3413628 0.110315 -0.0000074 -0.014526 0.0702752 0.0001202 -0.0002108 0.000281 -0.0902699 -0.0334463 -0.0395527 -0.0274583 -0.0176493 0.0521453 -0.0337857 0.0442838 -0.0379877 -0.0279664 -0.0332995 -0.039626 0.0273946 -0.0176429 0.0521044 0.0339114 -0.044124 0.0381278 -0.0278411 -0.3976147 0.1247874 0.0001528 0.3094731 -0.1706875 -0.000129 0.0002928 -0.0000706 -0.0989748 -0.169428 -0.0715264 -0.0000497 -0.1376413 -0.0103728 0.0000892 0.0000491 -0.000052 -0.1607013 0.6562489 -0.5621654 -0.0005837 -0.6704362 0.8126644 0.0008341 -0.0006022 0.0006524 -0.1130678 0.1019506 -0.0599652 -0.0000884 0.0546561 0.1114312 0.0000694 -0.000005 0.000119 -0.1246294 -0.149093 0.2058626 0.000166 0.145079 -0.3370704 -0.000163 0.0001467 -0.0002679 -0.1229148 -0.0142285 0.052664 0.0000738 0.0948373 -0.1524236 -0.000204 0.0000909 -0.0001381 0.0207211 0.0587853 0.1145593 0.0017729 0.0841187 -0.1041514 -0.0340323 -0.0144738 0.0249252 0.0679359 -0.2288081 -0.0457932 -0.0344187 -0.0538804 0.0819505 -0.02374 -0.0162881 -0.0167178 0.0763144 0.1013828 -0.0379666 0.0675398 -0.0161296 0.0228003 0.1067387 0.0444476 0.0689919 -0.1136463 0.1012183 -0.0378193 -0.0677997 -0.016165 0.0232101 -0.1064004 -0.0447284 -0.068623 -0.1139199 -0.2287259 -0.0458932 0.0345406 -0.0537711 0.0818373 0.0237812 0.0163702 0.0167381 0.0763718 0.0587855 0.1145926 -0.0015424 0.0842556 -0.1043708 0.0336245 0.0146336 -0.0253279 0.0679516 0.0936727 -0.0693858 -0.0000217 -0.0761583 -0.0303349 -0.0000717 -0.0000396 -0.0000873 0.1409514 -0.0094386 0.1225009 0.0001257 0.0945396 -0.016056 -0.0001073 0.0000894 -0.000084 0.1463615 0.0360662 -0.0535305 0.0000326 -0.0613254 -0.1053308 -0.0000845 -0.0000224 -0.000097 0.1581202 -0.062919 -0.0279988 0.0000175 -0.0172136 0.1013747 -0.0000281 0.0000346 -0.0000053 0.1659505 unknown
polarizability: 141.8922141|-14.2265869|123.9166217|-0.032327|0.0348022|62.4573512 unknown
InChI: InChI=1S/C9H11Br/c1-7(2)8-4-3-5-9(10)6-8/h3-7H,1-2H3
charge 0 multiplicity 1
21 atoms
Br -2.874086 2.063216 0.001938
C  2.160103 -0.088226 -0.00089
C  0.649846 -0.330434 -0.000574
C  2.62031 0.664083 1.277505
C  2.619451 0.666669 -1.278056
C  -0.255306 0.764553 0.000324
C  0.120865 -1.646201 -0.001025
C  -1.643728 0.528551 0.000697
C  -1.276241 -1.867013 -0.000644
C  -2.176902 -0.777983 0.000209
H  2.655469 -1.080563 -0.002058
H  2.174484 1.675236 1.328637
H  3.720153 0.779774 1.280498
H  2.325626 0.118192 2.19225
H  2.323966 0.122749 -2.193717
H  3.719319 0.782131 -1.281638
H  2.173821 1.678028 -1.326748
H  0.122613 1.792943 0.000762
H  0.806613 -2.502095 -0.001642
H  -1.672993 -2.88825 -0.001009
H  -3.258682 -0.943862 0.000481
