program: Gaussian 09
title: 000138496
version: EM64L-G09RevD.01
frameworkgroup: C1[X(C5H7N3)]
method: RPBEPBE
basis: SDD
operation: Freq
keyword: #p
keyword: freq=noraman
keyword: PBEPBE/SDD
title: #p freq=noraman PBEPBE/SDD
converged: NO YES NO YES
title: Mulliken charges:
elementType: N N N C C C C C H H H H H H H
charge: -0.088753 0.000373 0.000364 -0.352267 -0.352285 -0.632400 -0.135494 -0.135470 0.228525 0.257714 0.257712 0.228539 0.263268 0.196903 0.263271
chargesum: 0.00000
title: Mulliken charges with hydrogens summed into heavy atoms:
elementType: N N N C C C C C
charge: -0.088753 0.000373 0.000364 0.133971 0.133966 0.091042 -0.135494 -0.135470
polarizability: 9.10811704e+01 -4.61498863e-04 5.73830934e+01 2.09082337e-03 -3.84856136e+00 4.99209993e+01
1716.lowfreq: -9.2592 -2.7135 -0.0004 0.0003 0.0004 6.6416 48.5384 100.0887 113.3983
frequency: 48.5216 100.0822 113.3959 188.5010 231.5933 295.6563 316.2742 365.4797 369.5726 371.1100 460.5820 614.3571 807.9728 893.6321 956.7808 967.2633 991.9638 1036.7121 1116.3675 1150.8672 1181.6324 1265.8117 1270.0185 1329.0252 1382.6676 1440.7306 1442.3320 1457.0524 1476.5367 1477.8071 2210.1206 2210.8668 2846.4925 2854.5605 2892.3076 3025.0384 3025.1009 3055.1272 3109.3739
redmass: 6.7661 2.8816 7.5185 5.7661 1.0643 3.1287 3.0524 2.9917 4.4172 3.0824 11.1981 5.1143 5.3924 5.7860 1.6880 2.5659 2.3624 2.1200 1.3490 2.9451 1.3699 1.4216 1.3970 1.3680 1.4068 1.1476 1.0800 1.0846 1.0502 1.0467 12.4873 12.4940 1.0703 1.0695 1.0544 1.0866 1.0849 1.0764 1.1018
irintensity: 7.5326 0.6312 4.6591 1.6734 0.6739 13.0125 4.1758 0.2821 0.6268 0.0956 0.9223 0.7058 25.6613 0.5704 4.9348 2.8039 1.3592 68.4108 5.8160 14.9195 12.3346 2.5147 13.3609 18.0125 0.9666 10.9683 1.1738 7.3663 9.6772 32.1346 0.5536 0.7019 41.6420 97.4004 99.3396 0.3180 17.9585 16.9764 13.0062
temp: 298.150 k
press: 1.00000 atm
elementType: 7 7 7 6 6 6 6 6 1 1 1 1 1 1 1
symmnumber: 1
zpe: 301155.6 jmol-1
zpe.correction: 0.114704 hartree
zpe.thermalcorrener: 0.123588 hartree
zpe.thermalcorrenthalpy: 0.124532 hartree
zpe.thermalcorrgfe: 0.080591 hartree
zpe.sumelectzpe: -358.315469 hartree
zpe.sumelectthermal: -358.306585 hartree
zpe.sumelectthermalent: -358.305641 hartree
zpe.sumelectthermalfe: -358.349582 hartree
dipole: -0.0001 -2.7868 3.5450
dipole: 4.5092
quadrupole: -75.0166 -42.2572 -48.4388
quadrupole: 0.0003 -0.0008 0.9754
quadrupole: -19.7790 12.9803 6.7987 0.0003 -0.0008 0.9754
hfenergy: -358.4301731 hartree
pointgroup: C01 [X(C5H7N3)]
dipole: 0.0000712 -1.2223278 -1.2857783 debye
dipolederiv: -0.5262441 -0.0000076 -0.0000116 -0.000055 -0.4828676 -0.0122736 0.0000039 0.0080294 -0.5463133 -0.2317465 0.0311018 -0.002058 -0.0019783 -0.2065335 0.0070361 -0.0045328 0.0232303 -0.2110254 -0.2316335 -0.031036 0.0021765 0.0019441 -0.2065824 0.0069645 0.0045214 0.0231756 -0.2110967 0.5780293 -0.1960142 -0.0694167 -0.2930685 0.2712918 0.0694749 -0.0314308 0.0553651 0.4933465 0.5781129 0.1960077 0.0694106 0.2931203 0.2712833 0.0694441 0.0314866 0.0553281 0.493303 -0.0356211 -0.0000044 0.0000066 -0.0000013 0.29522 -0.1188868 0.0000078 -0.0751243 0.4242203 -0.0425161 0.050295 0.0381066 0.0383144 -0.0185584 0.0023942 0.0190278 -0.027894 -0.0549857 -0.0426647 -0.0503456 -0.0382068 -0.0383094 -0.0184993 0.0024711 -0.0190803 -0.0278211 -0.054888 -0.0798949 0.0268951 -0.0105099 0.0597825 0.044533 -0.0292403 0.122882 -0.1348238 -0.1626564 0.0451417 -0.0387818 -0.0025389 0.0139545 -0.0437846 0.0590509 0.0027109 0.0801921 0.059615 0.0451456 0.0387844 0.0025353 -0.0139457 -0.0437869 0.0590557 -0.0027059 0.0801855 0.0596125 -0.0799385 -0.0268945 0.0105069 -0.0597652 0.0445374 -0.0292397 -0.1228892 -0.1348076 -0.1626328 -0.028477 0.1279518 0.0300251 0.0960918 0.054034 -0.0043609 0.0476987 -0.0066702 0.0684124 0.0807807 0.0000033 -0.000012 0.0000003 -0.0143294 -0.077532 -0.0000082 0.0883007 -0.2633308 -0.0284736 -0.1279551 -0.0300136 -0.0960846 0.0540426 -0.0043582 -0.0476917 -0.0066658 0.0684195 unknown
polarizability: 91.0811704|0.0010811|58.0359632|0.0019081|3.0843816|49.2681295 unknown
InChI: InChI=1S/C5H7N3/c1-8(4-2-6)5-3-7/h4-5H2,1H3
charge 0 multiplicity 1
15 atoms
N  0.000031 -0.045805 -0.013317
N  3.439176 0.366456 0.572405
N  -3.439376 0.36626 0.572236
C  1.217854 -0.854422 -0.263827
C  -1.217836 -0.854378 -0.26374
C  0.000029 1.254909 -0.724479
C  2.439697 -0.169937 0.206493
C  -2.439616 -0.169861 0.206692
H  1.36607 -1.10339 -1.346543
H  1.132755 -1.812366 0.283762
H  -1.132724 -1.812336 0.283824
H  -1.366146 -1.103333 -1.346449
H  -0.891226 1.830853 -0.426884
H  -0.000012 1.144628 -1.836027
H  0.891322 1.830824 -0.426945
