program: Gaussian 09
title: 000138494
version: EM64L-G09RevD.01
frameworkgroup: C1[X(C12H24O2)]
method: RPBEPBE
basis: SDD
operation: Freq
keyword: #pfreq=noraman
keyword: PBEPBE/SDD
title: #p freq=noraman PBEPBE/SDD
converged: YES YES NO NO
title: Mulliken charges:
elementType: O O C C C C C C C C C C C C H H H H H H H H H H H H H H H H H H H H H H H H
charge: -0.416399 -0.239167 -0.108286 -0.443076 -0.443047 -0.371012 -0.370987 -0.353674 -0.353600 0.133577 -0.359638 -0.359663 -0.696837 -0.696839 0.237371 0.224536 0.202684 0.224493 0.202750 0.192814 0.206861 0.206847 0.192872 0.193559 0.186039 0.186076 0.193511 0.195267 0.197792 0.195308 0.197758 0.209210 0.215975 0.211237 0.215984 0.211242 0.209204 0.369258
chargesum: 0.00000
title: Mulliken charges with hydrogens summed into heavy atoms:
elementType: O O C C C C C C C C C C C C
charge: -0.047141 -0.239167 0.129084 -0.015856 -0.015804 0.028662 0.028733 0.025923 0.025987 0.133577 0.033421 0.033404 -0.060415 -0.060409
polarizability: 1.67307905e+02 -8.77754500e-03 1.27305059e+02 4.17020545e-02 -2.24833706e+00 1.16860901e+02
1716.lowfreq: -0.0006 0.0001 0.0008 6.8536 8.2968 9.8511 30.3469 30.4218 43.1914
frequency: 30.2078 30.3752 43.1608 47.6517 51.9586 58.2577 95.1124 112.5619 121.0343 124.6425 128.3780 183.0630 193.7281 201.4115 233.1996 233.5005 257.8322 310.2454 359.3823 371.3404 449.8830 476.6424 506.8432 585.9896 636.3662 717.7127 723.4069 729.2124 735.0327 758.3062 778.8303 832.6970 871.3578 889.5806 892.7829 947.7568 978.6922 979.8013 1002.0028 1025.6134 1031.4337 1052.3394 1055.5233 1071.3050 1076.6429 1084.3246 1098.2651 1115.2276 1126.4815 1141.3622 1197.4409 1202.3054 1225.2296 1238.0623 1248.4442 1256.7270 1267.0002 1279.2338 1290.0168 1290.9547 1294.5329 1297.3276 1310.6542 1319.0697 1344.6374 1349.9087 1356.5232 1360.5485 1376.4594 1389.5997 1389.6350 1454.0772 1460.6750 1462.9060 1463.5745 1468.9252 1470.7094 1477.8795 1477.9219 1478.5956 1479.3120 1487.5715 1487.7647 1656.7589 2953.4725 2953.6716 2959.8586 2960.0283 2968.5290 2968.7672 2972.4044 2972.4885 2975.2979 2978.6545 2991.1062 2991.1955 3007.8568 3008.2180 3017.2964 3027.6663 3031.6568 3044.9613 3053.9350 3068.9102 3069.0242 3071.5593 3071.6181 3493.4347
redmass: 3.8715 6.1658 3.2750 1.7208 1.8192 3.5225 3.3752 2.6428 2.6097 1.9648 1.7354 3.4045 2.3715 4.0649 1.1266 1.1262 3.5228 2.9446 3.4630 3.7550 3.2040 2.8676 3.4320 3.2444 1.2568 1.4907 1.1633 1.3613 1.5220 1.4886 1.4430 1.2863 1.3620 1.8838 1.8609 1.2527 1.2344 4.1281 4.9783 3.1630 2.3569 2.1015 1.7523 2.8286 2.2948 2.1435 1.9885 2.2076 2.1137 2.2288 1.5971 1.5228 1.2585 1.5236 1.3017 1.2768 1.3049 1.2011 1.0575 1.0847 1.1299 1.1701 1.2831 1.3261 1.4793 1.5009 1.6337 1.6153 1.6438 1.2171 1.2183 1.0765 1.0760 1.0736 1.0763 1.0748 1.0761 1.0422 1.0423 1.0737 1.0767 1.0852 1.0861 7.7547 1.0587 1.0588 1.0590 1.0593 1.0586 1.0585 1.0369 1.0370 1.0594 1.0591 1.0973 1.0972 1.0987 1.1009 1.0907 1.1037 1.1021 1.1047 1.1011 1.1007 1.1007 1.0993 1.0993 1.0636
irintensity: 0.2216 2.2693 0.0062 0.1517 0.0415 0.1425 0.1789 0.1362 0.0047 0.0004 0.0178 0.0207 0.0225 0.0346 0.0004 0.0006 3.0545 0.2664 5.0408 0.0134 4.1343 4.5068 17.0598 6.0109 127.2278 23.8011 26.4138 10.6743 2.1619 7.4100 1.7914 0.1780 4.6853 5.2984 6.9288 0.5305 0.0726 0.1018 24.3127 68.5795 0.0256 159.5400 0.0044 0.4941 2.0810 5.8348 21.5826 5.5051 7.7579 12.6130 0.5291 1.3431 7.0233 0.3234 0.6353 0.0519 4.4148 0.0090 2.0076 0.2295 0.1159 3.2006 0.6498 0.0592 1.5883 3.7173 0.5018 1.8592 18.2792 11.9072 10.8057 0.0158 3.2096 0.0059 1.9210 1.5886 3.0904 11.0541 13.7554 2.6394 6.5890 3.7248 37.2225 167.4579 0.2442 5.6908 0.1283 10.2481 1.8720 134.8549 55.2594 9.4019 0.1734 125.0003 0.1835 2.1078 1.2187 0.0919 8.4786 0.0361 57.7682 0.5057 114.7170 4.5024 189.4676 47.7851 59.6974 16.4024
temp: 298.150 k
press: 1.00000 atm
elementType: 8 8 6 6 6 6 6 6 6 6 6 6 6 6 1 1 1 1 1 1 1 1 1 1 1 1 1 1 1 1 1 1 1 1 1 1 1 1
symmnumber: 1
zpe: 889908.3 jmol-1
zpe.correction: 0.338948 hartree
zpe.thermalcorrener: 0.357335 hartree
zpe.thermalcorrenthalpy: 0.358280 hartree
zpe.thermalcorrgfe: 0.289644 hartree
zpe.sumelectzpe: -620.973717 hartree
zpe.sumelectthermal: -620.955330 hartree
zpe.sumelectthermalent: -620.954386 hartree
zpe.sumelectthermalfe: -621.023021 hartree
dipole: -0.0072 -0.6103 -1.3842
dipole: 1.5127
quadrupole: -87.9484 -84.6118 -94.5709
quadrupole: -0.0197 -0.0193 -2.0447
quadrupole: 1.0953 4.4319 -5.5272 -0.0197 -0.0193 -2.0447
hfenergy: -621.3126651 hartree
pointgroup: C01 [X(C12H24O2)]
dipole: 0.0033814 -0.2675723 0.5316066 debye
polarizability: 167.3078825|0.0473404|127.0486985|0.0106642|2.7689979|117.1172842 unknown
InChI: InChI=1S/C12H24O2/c1-3-5-7-9-11(12(13)14)10-8-6-4-2/h11,13H,3-10H2,1-2H3
charge 0 multiplicity 1
38 atoms
O  0.005855 2.390211 0.954853
O  -0.004508 1.948201 -1.32122
C  0.001861 0.055493 0.277672
C  -1.281374 -0.642615 -0.256856
C  1.286268 -0.639927 -0.258195
C  -2.597382 -0.071736 0.316072
C  2.60195 -0.066406 0.312732
C  -3.844396 -0.840983 -0.174703
C  3.849554 -0.833649 -0.179591
C  0.000369 1.516352 -0.145745
C  -5.1694 -0.275881 0.385836
C  5.174229 -0.267058 0.380209
C  -6.41012 -1.054524 -0.102149
C  6.415788 -1.042484 -0.110837
H  0.002783 0.026074 1.383347
H  -1.291051 -0.567311 -1.362236
H  -1.209036 -1.719949 -0.005601
H  1.294273 -0.565171 -1.363624
H  1.21625 -1.717306 -0.006394
H  -2.561233 -0.097851 1.424941
H  -2.696764 0.996047 0.031956
H  2.699115 1.001491 0.028277
H  2.567271 -0.092197 1.421649
H  -3.877437 -0.817444 -1.283912
H  -3.754034 -1.910225 0.111177
H  3.76095 -1.903223 0.105597
H  3.88165 -0.809326 -1.288822
H  -5.13239 -0.292811 1.494326
H  -5.26228 0.790227 0.094508
H  5.138732 -0.285959 1.488706
H  5.264749 0.799735 0.090633
H  -6.355498 -2.117472 0.20048
H  -7.343446 -0.632435 0.313758
H  -6.488037 -1.024511 -1.205407
H  7.34879 -0.620406 0.305801
H  6.493026 -1.009047 -1.214039
H  6.362801 -2.106422 0.188628
H  0.005225 3.330097 0.622275
