program: Gaussian 09
title: 000138493
version: EM64L-G09RevD.01
frameworkgroup: C1[X(C3H7N5)]
method: RPBEPBE
basis: SDD
operation: Freq
keyword: #p
keyword: freq=noraman
keyword: PBEPBE/SDD
title: #p freq=noraman PBEPBE/SDD
converged: NO NO NO NO
title: Mulliken charges:
elementType: N N N N N C C C H H H H H H H
charge: -0.105416 -0.090757 -0.164022 -0.355302 -0.013744 0.175250 -0.605758 -0.599991 0.212843 0.239783 0.249856 0.251334 0.207949 0.246229 0.351746
chargesum: 0.00000
title: Mulliken charges with hydrogens summed into heavy atoms:
elementType: N N N N N C C C
charge: -0.105416 -0.090757 -0.164022 -0.003556 -0.013744 0.175250 0.096724 0.105521
polarizability: 8.91011938e+01 -1.91598629e+00 6.68586679e+01 1.31207242e-01 5.51116687e-01 3.81740013e+01
1716.lowfreq: -109.1087 -8.8928 0.0008 0.0008 0.0011 2.9547 17.4978 48.8729 117.9052
frequency: -109.0588 48.2380 117.8846 146.2959 200.3771 330.1619 360.6883 494.2972 574.3161 616.7049 672.1234 717.3345 895.8700 955.1355 975.0078 1011.0923 1056.2860 1083.9759 1118.0771 1120.5457 1145.1364 1175.5961 1236.0239 1309.2113 1401.6880 1436.2089 1446.3438 1456.0407 1464.6105 1489.0025 1495.1254 1616.7586 2962.5458 2975.1440 3039.4953 3049.5489 3098.8227 3106.8279 3614.4525
redmass: 1.1721 1.0977 3.7928 2.5911 3.4457 6.6450 2.7795 5.2264 3.6238 4.1973 1.4961 8.9290 7.8004 7.4644 3.3121 6.3722 1.7023 4.1541 1.2369 1.3270 8.8016 3.5032 2.8628 3.6852 1.6229 1.1279 1.2410 1.0386 1.0460 1.0631 1.0662 6.0486 1.0371 1.0362 1.0980 1.1014 1.1002 1.0991 1.0841
irintensity: 1.2813 0.5835 0.7863 13.8275 2.1843 0.1937 2.7009 15.6525 37.0734 0.9325 111.8410 0.0797 23.1945 10.5124 12.9612 0.8494 8.6270 51.2287 1.0107 1.5099 10.3382 2.7206 4.1915 41.0872 20.3069 7.8333 15.3498 0.3500 22.6921 1.0780 10.5638 422.4696 72.6096 54.7590 25.6017 40.8957 8.0576 31.7032 92.5771
temp: 298.150 k
press: 1.00000 atm
elementType: 7 7 7 7 7 6 6 6 1 1 1 1 1 1 1
symmnumber: 1
zpe: 305125.5 jmol-1
zpe.correction: 0.116216 hartree
zpe.thermalcorrener: 0.123702 hartree
zpe.thermalcorrenthalpy: 0.124646 hartree
zpe.thermalcorrgfe: 0.083545 hartree
zpe.sumelectzpe: -391.590932 hartree
zpe.sumelectthermal: -391.583446 hartree
zpe.sumelectthermalent: -391.582502 hartree
zpe.sumelectthermalfe: -391.623602 hartree
dipole: 2.0075 2.1573 0.0279
dipole: 2.9470
quadrupole: -37.0156 -51.3882 -48.0796
quadrupole: -7.2094 -0.0638 -0.1924
quadrupole: 8.4789 -5.8938 -2.5851 -7.2094 -0.0638 -0.1924
hfenergy: -391.7071478 hartree
pointgroup: C01 [X(C3H7N5)]
dipole: -0.8228143 0.8166963 -0.0157025 debye
dipolederiv: -1.3531857 -0.0809988 -0.0067688 0.0126677 -0.5601619 0.0332652 0.0325108 -0.0142341 -0.3040542 -0.3379686 0.3098124 -0.0046173 -0.5054277 -0.3990713 0.0004425 0.0094645 0.0086235 -0.1602357 -0.6201533 -0.3574476 0.0051296 0.3088963 -0.1750244 -0.000208 -0.0014616 0.002694 -0.1895247 -0.2182147 -0.3991113 0.0045836 -0.2767792 -0.152641 0.0003953 -0.0014613 -0.0040179 -0.2164692 -0.0675789 0.3802502 -0.0057703 0.351314 0.2643873 -0.0030843 -0.0044186 -0.0073822 -0.1152122 1.7505053 0.112732 -0.0023744 0.09268 -0.1267202 -0.0040667 -0.0068037 0.0032244 0.1719858 0.2860666 -0.1921494 0.0148647 -0.3229161 0.4387465 -0.0500592 -0.0002924 -0.0541612 0.2558827 0.2639714 0.1885354 -0.002624 0.3044183 0.5024797 -0.0228636 -0.0076933 -0.0230318 0.2424555 -0.1486878 -0.0051167 0.0392385 -0.0843176 0.0821379 0.0268006 0.037311 0.0212199 0.1084218 0.0674287 -0.0080671 0.0352351 0.1073347 -0.0374564 0.0823186 -0.0437212 0.1355778 -0.116738 0.0822347 -0.0688642 -0.0795962 0.049675 -0.0448686 -0.0808754 -0.0250651 -0.0991723 -0.032234 0.0906486 0.0576158 0.0757375 -0.0587563 -0.0456531 -0.0753742 0.0189477 -0.1101263 -0.0552324 -0.1568978 -0.0054389 -0.0198192 0.0795904 0.0838949 0.0112467 -0.0166188 0.0096862 0.1154637 0.0919463 0.0297838 -0.0529133 -0.0816708 -0.0495133 0.0796573 0.0091203 0.1286075 -0.0885804 0.2698852 0.0384644 -0.0003055 0.0232912 0.2194641 0.0024053 0.0001818 0.0024924 0.3840715 unknown
polarizability: 88.9141167|2.7924909|67.0394843|0.1859263|-0.6827568|38.1802619 unknown
InChI: InChI=1S/C3H7N5/c1-8(2)3-4-6-7-5-3/h6H,1-2H3
charge 0 multiplicity 1
15 atoms
N  -1.390697 -0.033611 0.009365
N  0.703149 1.196738 -0.014766
N  0.79101 -1.13045 0.017806
N  1.987368 0.686087 -0.005254
N  2.077522 -0.689607 0.011741
C  -0.024526 0.021652 0.003236
C  -2.145915 1.226335 0.000018
C  -2.046679 -1.350726 -0.006175
H  -3.210671 1.013425 0.18982
H  -2.053236 1.752686 -0.970945
H  -1.774265 1.909385 0.786264
H  -1.694845 -1.961025 -0.858302
H  -3.135698 -1.206663 -0.096473
H  -1.834139 -1.919071 0.91935
H  2.80982 1.287345 -0.014684
