program: Gaussian 09
title: 000138491
version: EM64L-G09RevD.01
frameworkgroup: C1[X(C4H10S3)]
method: RPBEPBE
basis: SDD
operation: Freq
keyword: #pfreq=noraman
keyword: PBEPBE/SDD
title: #p freq=noraman PBEPBE/SDD
converged: YES YES NO NO
title: Mulliken charges:
elementType: S S S C C C C H H H H H H H H H H
charge: 0.252000 0.252036 0.251946 -0.912385 -0.839856 -0.839485 -0.839930 0.315104 0.257713 0.252332 0.276894 0.252100 0.276992 0.257543 0.257751 0.252328 0.276918
chargesum: 0.00000
title: Mulliken charges with hydrogens summed into heavy atoms:
elementType: S S S C C C C
charge: 0.252000 0.252036 0.251946 -0.597281 -0.052917 -0.052850 -0.052934
polarizability: 1.10085963e+02 -3.79213648e-03 1.10008644e+02 -3.50992565e-03 -7.95948316e-03 7.06647669e+01
1716.lowfreq: -7.9850 -0.0010 0.0014 0.0034 2.2251 5.6962 63.4108 66.3818 87.1060
frequency: 63.4078 66.3462 87.0999 117.9662 122.3220 128.8475 155.5807 157.9528 164.5690 275.8626 276.3367 304.9042 631.5696 647.2986 647.7599 648.0955 691.7824 692.2947 965.4378 967.0735 967.7137 978.4263 978.5657 979.3290 1159.6924 1162.0445 1332.8550 1336.5974 1336.8325 1443.8085 1443.9882 1444.4818 1459.7069 1461.1604 1461.8148 3002.9587 3003.1053 3003.6339 3026.2688 3121.9287 3122.2472 3122.6265 3133.3074 3133.4653 3133.6870
redmass: 3.3707 3.3795 3.4132 1.0665 1.0827 1.1055 3.8862 3.1960 3.5151 5.9236 5.9127 13.2993 5.5687 7.0667 7.0226 7.2326 8.0644 8.0019 1.1940 1.1849 1.1872 1.2445 1.2468 1.2685 1.0931 1.0920 1.1295 1.1305 1.1302 1.0524 1.0523 1.0524 1.0549 1.0542 1.0540 1.0285 1.0284 1.0288 1.0862 1.1058 1.1057 1.1057 1.1029 1.1030 1.1030
irintensity: 1.8742 1.9414 2.2748 0.6095 0.6017 0.4253 0.9841 0.8500 0.6114 0.1880 0.1950 0.2298 0.2253 1.2993 1.2824 1.3708 41.5561 41.2968 1.7904 0.9998 0.6419 17.6314 17.2079 20.2128 24.9944 24.7825 0.3374 2.4984 2.5857 15.4452 15.5400 15.7258 2.4258 21.1924 20.5144 27.4605 27.0147 40.1914 11.1879 11.5753 12.8561 26.8946 6.6310 6.4713 5.2992
temp: 298.150 k
press: 1.00000 atm
elementType: 16 16 16 6 6 6 6 1 1 1 1 1 1 1 1 1 1
symmnumber: 1
zpe: 344301.7 jmol-1
zpe.correction: 0.131138 hartree
zpe.thermalcorrener: 0.142742 hartree
zpe.thermalcorrenthalpy: 0.143686 hartree
zpe.thermalcorrgfe: 0.092538 hartree
zpe.sumelectzpe: -1351.996124 hartree
zpe.sumelectthermal: -1351.984520 hartree
zpe.sumelectthermalent: -1351.983575 hartree
zpe.sumelectthermalfe: -1352.034723 hartree
dipole: -0.0039 -0.0013 3.8183
dipole: 3.8183
quadrupole: -62.4602 -62.4626 -67.8614
quadrupole: -0.0012 0.0051 -0.0079
quadrupole: 1.8012 1.7988 -3.6000 -0.0012 0.0051 -0.0079
hfenergy: -1352.1272611 hartree
pointgroup: C01 [X(C4H10S3)]
dipole: 0.0002774 0.0004071 -1.5022443 debye
dipolederiv: -0.3011522 -0.0695333 0.0163416 -0.0424251 -0.2208033 0.0598875 0.0084073 0.0668243 -0.0078369 -0.2886567 0.0481774 -0.0602074 0.0749203 -0.2308896 -0.0167195 -0.062699 -0.0259382 -0.0078612 -0.1924982 -0.0199234 0.0435723 0.0064796 -0.3292755 -0.0435499 0.054239 -0.0409733 -0.0072331 0.7389033 0.0039653 -0.0003422 -0.0026542 0.7382048 -0.0003053 0.0000702 -0.0004334 -0.031913 -0.0347247 -0.0098947 -0.078498 -0.0719814 -0.0109221 -0.0136146 -0.0945472 -0.0442885 0.0797149 -0.0523811 0.0628433 0.0508072 0.0009893 0.0066811 -0.0607557 0.0846561 -0.0596498 0.0790456 0.0181734 0.0410087 0.0275393 -0.0206572 -0.064391 0.0751599 0.0088886 0.1046479 0.0795709 -0.0933147 0.0460841 0.0000378 -0.0458036 -0.093276 -0.0000026 0.0003174 0.0000539 -0.1293089 -0.1136716 -0.051392 -0.0247762 -0.0583069 0.0995786 -0.0306755 0.0006566 -0.0348623 0.0853593 0.042878 0.0366308 -0.0177493 0.0475274 0.0710417 0.0238479 0.0569255 0.0509006 -0.1567061 0.1203019 0.0115061 0.0340665 0.0755731 -0.0830949 -0.0206086 0.0492035 -0.0141106 0.0531673 0.101329 -0.0143387 -0.0097033 -0.0030863 0.0135229 -0.0274485 -0.0706325 0.0235507 -0.1570917 0.0064522 -0.142516 -0.0006997 -0.0783971 0.0296719 0.039432 -0.0136289 0.0492776 0.0533921 -0.0032565 0.1229487 0.0388693 0.1159225 -0.0117503 -0.005427 0.0299199 0.0187025 0.0861642 0.0936676 -0.0617944 -0.0139356 -0.0689248 -0.1078557 0.0373082 -0.0302623 0.0173386 0.0848995 0.0273627 -0.0382644 0.0298563 -0.0276447 0.0862543 0.0024493 0.015837 -0.0757903 -0.1565951 -0.0694123 0.0344924 -0.0351785 0.098469 0.1073032 -0.0189778 -0.0373512 -0.0352495 0.0532322 unknown
polarizability: 110.0201786|0.0278133|110.0743948|-0.0312814|-0.0195672|70.6647995 unknown
InChI: InChI=1S/C4H10S3/c1-5-4(6-2)7-3/h4H,1-3H3
charge 0 multiplicity 1
17 atoms
S  1.507216 0.952782 0.746104
S  -1.578391 0.827854 0.746351
S  0.070731 -1.781669 0.74893
C  0.000312 -0.000535 0.13784
C  2.794111 0.242573 -0.440341
C  -1.606618 2.300156 -0.436875
C  -1.187567 -2.541687 -0.437421
H  0.000599 -0.002087 -0.966429
H  3.770697 0.62203 -0.101335
H  2.599085 0.578097 -1.471446
H  2.777616 -0.856481 -0.376017
H  -1.790219 1.964853 -1.470176
H  -0.650362 2.841045 -0.364581
H  -2.430171 2.95017 -0.102352
H  -1.350188 -3.575838 -0.095792
H  -0.797763 -2.544614 -1.467903
H  -2.130187 -1.975949 -0.376456
