program: Gaussian 09
title: 000138490
version: EM64L-G09RevD.01
frameworkgroup: C1[X(C6H13NO2)]
method: RPBEPBE
basis: SDD
operation: Freq
keyword: #p
keyword: freq=noraman
keyword: PBEPBE/SDD
title: #p freq=noraman PBEPBE/SDD
converged: YES YES NO NO
title: Mulliken charges:
elementType: O O N C C C C C C H H H H H H H H H H H H H
charge: -0.418973 -0.232525 -0.615874 -0.024135 -0.420987 -0.385069 -0.499790 -0.695822 0.172396 0.180471 0.243517 0.219713 0.203479 0.191149 0.246967 0.266033 0.247783 0.206452 0.209233 0.261992 0.267596 0.376393
chargesum: 0.00000
title: Mulliken charges with hydrogens summed into heavy atoms:
elementType: O O N C C C C C C
charge: -0.042581 -0.232525 -0.086285 0.156336 0.042243 0.009560 0.013211 -0.032354 0.172396
polarizability: 9.26670411e+01 -1.38146915e+00 7.72908441e+01 -1.30835172e+00 -5.02691850e+00 6.39664886e+01
1716.lowfreq: -39.6263 -0.0012 -0.0011 -0.0011 7.2820 8.4712 20.4447 49.1235 99.4716
frequency: 9.1468 47.0495 99.3828 125.4931 156.6353 204.4899 230.5551 257.5782 271.4468 337.8656 413.9457 478.1941 514.2261 543.5519 585.5287 623.9076 647.0311 754.2079 789.2747 819.6390 867.2357 955.2884 991.5583 1004.2108 1038.4017 1052.8130 1080.0903 1096.0328 1144.2458 1167.5057 1213.3996 1241.1633 1264.1106 1272.8143 1289.8243 1333.9425 1351.6274 1373.9599 1382.5470 1390.5140 1440.4668 1465.1190 1474.7548 1478.8951 1493.3097 1636.0629 1667.9043 2826.1023 2969.2091 2977.6967 2980.2902 2996.7512 3019.0983 3046.4633 3065.8541 3070.6560 3091.3906 3446.1557 3509.8787 3574.6652
redmass: 6.6697 3.4181 2.4859 2.9379 2.0245 1.2558 2.6457 1.1563 2.6609 3.9407 2.3812 2.7230 2.1206 1.7995 3.2069 1.5641 1.3821 1.7506 1.2762 2.0885 4.1730 1.8994 1.6096 2.1747 1.9098 1.8257 2.3529 2.1742 1.9152 1.3640 1.4716 1.3958 1.1981 1.1445 1.3901 1.7930 1.4242 1.4139 1.5110 1.5143 1.0823 1.0601 1.0679 1.0700 1.0621 1.0990 8.1269 1.0812 1.0615 1.0659 1.0384 1.0629 1.0973 1.0922 1.0990 1.0991 1.0998 1.0447 1.0639 1.0976
irintensity: 1.0913 0.3785 0.1471 2.2854 0.3933 0.9706 7.4699 36.9908 3.9107 7.8466 3.8567 19.3309 32.0495 124.0432 49.4545 55.0694 143.0122 5.7091 8.2211 14.9806 3.6691 22.0586 2.4741 11.5801 101.3664 125.9131 35.4877 17.0361 1.7303 3.3966 8.6152 1.1444 4.3213 4.2913 9.0767 57.4668 31.2617 21.5103 10.2358 11.2800 25.3120 12.1379 5.4169 20.3664 5.4793 56.4559 206.7967 114.8867 55.8694 12.5740 24.6789 15.0697 37.5261 5.5353 63.1938 38.7687 26.4402 1.3821 19.6529 0.1160
temp: 298.150 k
press: 1.00000 atm
elementType: 8 8 7 6 6 6 6 6 6 1 1 1 1 1 1 1 1 1 1 1 1 1
symmnumber: 1
zpe: 494363.7 jmol-1
zpe.correction: 0.188293 hartree
zpe.thermalcorrener: 0.199440 hartree
zpe.thermalcorrenthalpy: 0.200384 hartree
zpe.thermalcorrgfe: 0.149557 hartree
zpe.sumelectzpe: -440.893026 hartree
zpe.sumelectthermal: -440.881879 hartree
zpe.sumelectthermalent: -440.880935 hartree
zpe.sumelectthermalfe: -440.931762 hartree
dipole: 0.7579 0.4909 -1.8309
dipole: 2.0414
quadrupole: -50.2825 -57.0514 -57.6869
quadrupole: -5.8416 -2.1822 3.4753
quadrupole: 4.7244 -2.0445 -2.6799 -5.8416 -2.1822 3.4753
hfenergy: -441.0813194 hartree
pointgroup: C01 [X(C6H13N1O2)]
dipole: 0.3013959 0.2406593 -0.7044934 debye
dipolederiv: -0.8373679 0.5356645 -0.1595666 0.5017687 -0.7963284 0.0612981 -0.1079438 0.0405309 -0.4210479 -0.7018204 -0.1773443 0.1262248 0.0556181 -0.8390643 0.2089412 0.0597833 0.2575641 -0.4233937 -0.4879707 0.1647283 -0.1682597 0.1705353 -0.480311 -0.0035205 -0.1863993 0.0047898 -0.6461089 0.4174581 -0.1601661 0.1374095 -0.1732231 0.4263846 -0.0685372 0.067436 0.0109195 0.4110229 -0.0207786 0.0405577 0.0369897 -0.0492638 0.0510242 0.0478052 0.0727655 0.0452201 0.0599229 0.1171645 -0.0518699 -0.0003809 -0.012288 0.0057534 -0.0124799 -0.0017784 -0.0097084 0.081924 -0.2948667 -0.003111 0.1058583 -0.0955113 0.001729 0.1031981 0.2419844 0.0832068 0.0660466 0.0747014 0.0004384 -0.0286694 -0.0189259 -0.0119552 -0.0600261 -0.036404 -0.0356063 -0.0657839 1.4183998 -0.233225 -0.1299598 -0.3376753 1.2775939 -0.3976148 -0.1813324 -0.4065766 0.388775 -0.0630746 0.0193602 -0.0956019 0.0015383 -0.0488566 -0.027307 -0.1085683 -0.0065723 -0.3172979 0.063594 0.0200362 -0.0286027 0.0447014 0.0779497 -0.0344937 -0.0186516 -0.0245982 -0.1179363 0.0533507 -0.0614975 -0.0147137 -0.0472247 -0.1392678 -0.0225385 -0.0267208 -0.026392 0.07666 0.0079128 0.1075058 -0.1139768 0.0914523 -0.0483938 0.065376 -0.1043063 0.0551718 -0.0468647 -0.1842543 -0.0296521 0.1311346 0.0074052 0.0580066 -0.029846 0.1031943 -0.029759 -0.0229422 0.0760891 -0.007631 0.0130923 0.0035868 0.1007913 -0.0195304 -0.0526912 0.0106677 -0.0871331 0.0848778 -0.0188172 0.0019101 -0.0043717 -0.0804471 -0.0314095 -0.0269488 -0.0424749 0.0907046 0.038685 0.0584862 -0.0592207 0.0981204 0.049876 0.1171612 -0.0513911 0.065481 0.0132801 0.0128831 -0.1338077 -0.0195779 -0.1401768 -0.1377994 -0.0463928 -0.0013827 -0.0172554 0.0711402 -0.1375058 0.0531553 0.1164862 0.034423 0.0896884 -0.0095824 0.0964234 -0.0131332 0.0139613 0.0319615 0.0384819 0.0904511 0.0394311 0.1875932 0.0694475 0.1893685 0.046352 0.2203149 0.1560254 -0.0841994 -0.0142916 -0.0477216 -0.0079981 0.0157069 -0.0243804 -0.0716318 0.3103579 0.1745358 -0.0770933 0.0732651 -0.1221984 0.2640314 0.0743443 0.0979436 0.0638042 0.3443984 unknown
polarizability: 92.697986|-1.1829821|77.8656734|-1.1795774|-4.1476212|63.3607145 unknown
InChI: InChI=1S/C6H13NO2/c1-2-5(7)3-4-6(8)9/h5,8H,2-4,7H2,1H3
charge 0 multiplicity 1
22 atoms
O  -3.157842 0.980185 -0.254347
O  -2.638873 -1.14894 0.507545
N  2.529164 -1.464267 -0.017676
C  1.587377 -0.492349 -0.61634
C  0.213692 -0.666575 0.074195
C  2.180465 0.938636 -0.485661
C  -0.865772 0.276968 -0.48711
C  2.3279 1.441513 0.966265
C  -2.261954 -0.076991 -0.014579
H  1.428366 -0.673071 -1.712463
H  0.333709 -0.511551 1.161385
H  -0.128449 -1.712681 -0.052773
H  1.556498 1.641178 -1.073169
H  3.176461 0.938512 -0.976068
H  -0.87825 0.235813 -1.59666
H  -0.670643 1.333021 -0.227865
H  2.875489 0.698393 1.571238
H  2.879076 2.399221 0.997687
H  1.344161 1.607818 1.443321
H  3.472468 -1.4328 -0.418392
H  2.166797 -2.421805 0.038705
H  -4.068441 0.706273 0.042262
